program: Orca
programVersion: 5.0.2
elementType: O O O O N N C C C C C C C C C C C C C C C C C H H H H H H H H H H H H H H H H H H H H H H
charge: 0
multiplicity: 1
keywords: wb97x-d3
keywords: def2-TZVPP
keywords: def2/J RIJCOSX
keywords: DEFGRID2
keywords: scfconv7
keywords: smallprint printgap noloewdin
keywords: NOSOSCF
formula: C17H22N2O4
InChI: InChI=1/C17H22N2O4/c1-6-7-18-9-13(20)19(16(18)22)10-23-15(21)14-12(8-11(2)3)17(14,4)5/h1,8,12,14H,7,9-10H2,2-5H3
45 atoms
O  0.266731 1.336453 0.839435
O  -0.455961 2.712145 -0.781204
O  1.563301 0.436984 -2.076391
O  3.184348 -0.285263 2.118882
N  2.271111 0.410074 0.107012
N  3.434828 -1.463427 0.156006
C  -3.2557 2.222199 0.556564
C  -3.103119 1.314983 -0.614513
C  -2.008448 1.356782 0.435978
C  -4.197793 1.825441 1.668143
C  -3.18519 3.715012 0.34895
C  -3.924415 0.087437 -0.776735
C  -0.688521 1.895274 0.074459
C  -3.463381 -1.110469 -1.14521
C  -4.379225 -2.288903 -1.276201
C  -2.021158 -1.393372 -1.438765
C  1.631147 1.603328 0.568586
C  2.169686 -0.075741 -1.169406
C  2.996796 -0.455657 0.936261
C  2.952473 -1.362327 -1.195836
C  4.194579 -2.588051 0.637228
C  3.387099 -3.800544 0.753743
C  2.724749 -4.798934 0.834633
H  -2.838635 1.821734 -1.540447
H  -1.974144 0.512857 1.115555
H  -3.90776 2.302585 2.606309
H  -5.216799 2.145154 1.439838
H  -4.218467 0.748889 1.838871
H  -2.591282 4.003292 -0.515254
H  -4.192466 4.107731 0.19523
H  -2.77116 4.21652 1.226031
H  -4.990761 0.196094 -0.595178
H  -5.409209 -2.042363 -1.017968
H  -4.37137 -2.681735 -2.296317
H  -4.055991 -3.108577 -0.628607
H  -1.411288 -0.497289 -1.536199
H  -1.580389 -2.014518 -0.653428
H  -1.923885 -1.959887 -2.367938
H  1.752775 2.392187 -0.170675
H  2.101096 1.913118 1.498822
H  2.301504 -2.196437 -1.473101
H  3.765518 -1.303987 -1.924314
H  4.629222 -2.33332 1.604273
H  5.030778 -2.771428 -0.041471
H  2.139141 -5.688899 0.899669
elementType: O N C H
totalener: -1071.54631707 hartree
nucrepener: 1959.11533380 hartree
electener: -3030.66165088 hartree
oneelecener: -5350.76280044 hartree
twoeener: 2320.10114957 hartree
cpcmener: -0.04202543 hartree
kineticenergy: 1066.86515120 hartree
xcener: -102.623149672446 hartree
chargesum: -0.0000000
charge: -0.279261 -0.455158 -0.447806 -0.487901 -0.113217 -0.152294 0.142664 0.001002 -0.121936 -0.280736 -0.283713 -0.302927 0.388813 -0.009527 -0.227261 -0.232932 0.064886 0.292851 0.384689 0.009736 -0.059515 -0.425554 0.066019 0.105177 0.097746 0.098346 0.097889 0.092804 0.093857 0.094537 0.098871 0.120424 0.088442 0.095991 0.093751 0.075140 0.101537 0.101553 0.139595 0.131233 0.125001 0.121739 0.130243 0.141427 0.283777
qa: -0.2793 -0.4552 -0.4478 -0.4879 -0.1132 -0.1523 0.1427 0.0010 -0.1219 -0.2807 -0.2837 -0.3029 0.3888 -0.0095 -0.2273 -0.2329 0.0649 0.2929 0.3847 0.0097 -0.0595 -0.4256 0.0660 0.1052 0.0977 0.0983 0.0979 0.0928 0.0939 0.0945 0.0989 0.1204 0.0884 0.0960 0.0938 0.0751 0.1015 0.1016 0.1396 0.1312 0.1250 0.1217 0.1302 0.1414 0.2838
va: 2.1030 2.0528 2.0653 2.0387 3.1160 3.1950 3.7010 3.8001 3.8108 3.9063 3.8960 3.8967 4.1575 3.7184 3.9316 3.9352 3.8866 4.1897 4.3143 3.8997 3.8980 3.7392 3.5735 1.0243 1.0291 1.0029 1.0005 1.0027 1.0187 1.0007 0.9990 1.0047 1.0066 0.9967 0.9964 1.0130 0.9980 1.0013 1.0172 1.0130 1.0040 1.0063 1.0069 0.9849 0.9478
dispcorr: -0.021884400 hartree
energy: -1071.568201472795
dipole: -27.84366 28.39456 0.55091 -2.29763 0.36599 -1.93164 -1.75350 1.74210 -0.01141
magnitude: 2.00870 au
magnitude: 5.10571 debye
