program: Orca
programVersion: 5.0.2
elementType: O O O O N N C C C C C C C C C C C C C C C C C H H H H H H H H H H H H H H H H H H H H H H
charge: 0
multiplicity: 1
keywords: wb97x-d3
keywords: def2-TZVPP
keywords: def2/J RIJCOSX
keywords: DEFGRID2
keywords: scfconv7
keywords: smallprint printgap noloewdin
keywords: NOSOSCF
formula: C17H22N2O4
InChI: InChI=1/C17H22N2O4/c1-6-7-18-9-13(20)19(16(18)22)10-23-15(21)14-12(8-11(2)3)17(14,4)5/h1,8,12,14H,7,9-10H2,2-5H3
45 atoms
O  0.490768 1.467272 1.1525
O  -0.136694 1.622047 -0.98804
O  2.885743 1.526328 -1.936071
O  2.11484 -1.064189 1.734105
N  2.356851 0.516877 0.064757
N  2.774568 -1.598693 -0.408281
C  -2.997921 1.976557 0.257471
C  -2.823409 0.538956 -0.122822
C  -1.766733 1.216932 0.725025
C  -3.99352 2.329192 1.33546
C  -2.896218 3.026706 -0.820389
C  -3.62795 -0.54993 0.481358
C  -0.424757 1.461203 0.172198
C  -4.57897 -1.251275 -0.142069
C  -5.315057 -2.350875 0.561427
C  -4.997667 -1.01987 -1.561263
C  1.854507 1.632726 0.808462
C  2.781101 0.54966 -1.239451
C  2.393573 -0.778255 0.59225
C  3.114982 -0.873838 -1.605037
C  3.0649 -2.997191 -0.22666
C  4.492128 -3.256193 -0.04645
C  5.667157 -3.468554 0.083283
H  -2.532971 0.38964 -1.158587
H  -1.770642 0.954588 1.777495
H  -5.001903 2.380656 0.919124
H  -4.009888 1.605217 2.149885
H  -3.764309 3.305729 1.766373
H  -2.490683 3.960915 -0.426107
H  -2.280459 2.720802 -1.662854
H  -3.893497 3.242112 -1.209759
H  -3.41679 -0.78847 1.520011
H  -5.183084 -3.304915 0.043723
H  -4.979827 -2.479515 1.590774
H  -6.390858 -2.156623 0.578671
H  -6.064254 -0.784376 -1.609267
H  -4.461238 -0.206692 -2.047334
H  -4.856527 -1.922154 -2.162182
H  2.022424 2.539477 0.228022
H  2.376598 1.719755 1.758158
H  2.527143 -1.196335 -2.467917
H  4.175704 -0.958784 -1.85932
H  2.698291 -3.551104 -1.09354
H  2.50686 -3.36566 0.634933
H  6.711299 -3.648817 0.211587
elementType: O N C H
totalener: -1071.54713378 hartree
nucrepener: 1939.49732031 hartree
electener: -3011.04445409 hartree
oneelecener: -5311.70871424 hartree
twoeener: 2300.66426015 hartree
cpcmener: -0.04270852 hartree
kineticenergy: 1066.87158863 hartree
xcener: -102.624027842027 hartree
chargesum: 0.0000000
charge: -0.281709 -0.461176 -0.442199 -0.484444 -0.128985 -0.156233 0.153460 0.002474 -0.143614 -0.260677 -0.294367 -0.267197 0.417669 -0.033114 -0.226787 -0.250449 0.082137 0.297176 0.378481 -0.002874 -0.060003 -0.428106 0.068239 0.099676 0.089152 0.095697 0.089272 0.098219 0.099778 0.094814 0.094216 0.120142 0.094032 0.088867 0.093425 0.095473 0.088388 0.096369 0.132924 0.147740 0.121469 0.125756 0.141068 0.132363 0.283457
qa: -0.2817 -0.4612 -0.4422 -0.4844 -0.1290 -0.1562 0.1535 0.0025 -0.1436 -0.2607 -0.2944 -0.2672 0.4177 -0.0331 -0.2268 -0.2504 0.0821 0.2972 0.3785 -0.0029 -0.0600 -0.4281 0.0682 0.0997 0.0892 0.0957 0.0893 0.0982 0.0998 0.0948 0.0942 0.1201 0.0940 0.0889 0.0934 0.0955 0.0884 0.0964 0.1329 0.1477 0.1215 0.1258 0.1411 0.1324 0.2835
va: 2.1143 2.0506 2.0779 2.0405 3.0979 3.1885 3.6613 3.7774 3.8978 3.9059 3.9008 3.8769 4.1515 3.7143 3.9262 3.9443 3.8906 4.2061 4.3288 3.8925 3.9027 3.7441 3.5709 1.0239 1.0400 1.0030 1.0033 1.0027 0.9994 1.0195 1.0007 1.0081 0.9955 1.0084 0.9964 0.9976 1.0084 0.9978 1.0174 0.9932 1.0083 1.0043 0.9853 1.0044 0.9479
dispcorr: -0.020868437 hartree
energy: -1071.568002214217
dipole: -35.51324 35.11838 -0.39486 -1.03167 -0.22143 -1.25310 -1.26393 1.11274 -0.15119
magnitude: 1.32251 au
magnitude: 3.36157 debye
