program: Orca
programVersion: 5.0.2
elementType: O O O O N N C C C C C C C C C C C C C C C C C H H H H H H H H H H H H H H H H H H H H H H
charge: 0
multiplicity: 1
keywords: wb97x-d3
keywords: def2-TZVPP
keywords: def2/J RIJCOSX
keywords: DEFGRID2
keywords: scfconv7
keywords: smallprint printgap noloewdin
keywords: NOSOSCF
formula: C17H22N2O4
InChI: InChI=1/C17H22N2O4/c1-6-7-18-9-13(20)19(16(18)22)10-23-15(21)14-12(8-11(2)3)17(14,4)5/h1,8,12,14H,7,9-10H2,2-5H3
45 atoms
O  0.385296 1.426578 0.255491
O  -0.646665 1.024174 2.205233
O  3.601423 2.551357 -1.10352
O  2.046907 -1.111595 1.112567
N  2.637009 0.935896 0.219627
N  3.776744 -0.85272 -0.391064
C  -2.298864 -0.851295 0.253215
C  -3.128825 0.313336 0.709141
C  -1.757126 0.566563 0.134448
C  -2.645657 -1.53405 -1.046566
C  -1.743486 -1.798371 1.288095
C  -4.318442 0.771652 -0.046109
C  -0.652921 1.016494 0.999868
C  -5.5870 0.687744 0.365439
C  -6.710505 1.193311 -0.488691
C  -6.011356 0.090165 1.672058
C  1.627889 1.698282 0.883655
C  3.508965 1.411163 -0.724975
C  2.753016 -0.448555 0.386939
C  4.319669 0.224302 -1.178144
C  4.132328 -2.232906 -0.599067
C  3.65175 -2.741662 -1.882561
C  3.266617 -3.142161 -2.947136
H  -3.187702 0.417647 1.788158
H  -1.716964 0.951256 -0.879374
H  -1.783779 -2.07972 -1.435683
H  -3.451768 -2.255291 -0.895049
H  -2.968829 -0.835804 -1.817898
H  -1.602085 -1.337698 2.263677
H  -2.432427 -2.634643 1.422795
H  -0.784965 -2.212877 0.968779
H  -4.129453 1.209109 -1.022594
H  -7.290215 1.958306 0.035192
H  -6.356296 1.624437 -1.425156
H  -7.411209 0.389805 -0.731974
H  -5.18287 -0.27232 2.278173
H  -6.571024 0.815191 2.268959
H  -6.6867 -0.753164 1.503369
H  1.859363 2.75591 0.773643
H  1.608198 1.447262 1.942032
H  4.184305 0.065948 -2.252114
H  5.383106 0.386045 -0.984922
H  3.72336 -2.82913 0.217236
H  5.218422 -2.336398 -0.547173
H  2.915768 -3.50551 -3.887402
elementType: O N C H
totalener: -1071.54753537 hartree
nucrepener: 1927.78276571 hartree
electener: -2999.33030108 hartree
oneelecener: -5288.25199063 hartree
twoeener: 2288.92168955 hartree
cpcmener: -0.04100797 hartree
kineticenergy: 1066.86328856 hartree
xcener: -102.622563048290 hartree
chargesum: 0.0000000
charge: -0.279335 -0.449833 -0.448070 -0.488698 -0.116750 -0.148030 0.142478 0.011862 -0.118121 -0.260769 -0.287405 -0.273676 0.382764 -0.033718 -0.225323 -0.251597 0.070495 0.299057 0.391015 -0.002372 -0.053418 -0.426879 0.063514 0.095099 0.092035 0.097896 0.095853 0.088112 0.095322 0.097750 0.092489 0.119121 0.093856 0.088181 0.093021 0.089640 0.095724 0.095384 0.127574 0.142426 0.124142 0.123028 0.131892 0.140963 0.283299
qa: -0.2793 -0.4498 -0.4481 -0.4887 -0.1167 -0.1480 0.1425 0.0119 -0.1181 -0.2608 -0.2874 -0.2737 0.3828 -0.0337 -0.2253 -0.2516 0.0705 0.2991 0.3910 -0.0024 -0.0534 -0.4269 0.0635 0.0951 0.0920 0.0979 0.0959 0.0881 0.0953 0.0977 0.0925 0.1191 0.0939 0.0882 0.0930 0.0896 0.0957 0.0954 0.1276 0.1424 0.1241 0.1230 0.1319 0.1410 0.2833
va: 2.1077 2.0605 2.0731 2.0291 3.1160 3.1924 3.6811 3.7797 3.8776 3.9040 3.8962 3.8732 4.1909 3.7224 3.9255 3.9442 3.8705 4.2009 4.2970 3.8957 3.8987 3.7477 3.5765 1.0282 1.0370 1.0031 1.0035 1.0037 1.0165 1.0020 1.0107 1.0082 0.9957 1.0085 0.9963 1.0087 0.9977 0.9973 1.0132 1.0174 1.0068 1.0064 1.0063 0.9853 0.9483
dispcorr: -0.020924660 hartree
energy: -1071.568460029917
dipole: -34.26983 35.19068 0.92085 -8.21629 7.08267 -1.13362 -1.00792 -0.43308 -1.44100
magnitude: 2.05172 au
magnitude: 5.21506 debye
