program: Orca
programVersion: 5.0.2
elementType: O O O O N N C C C C C C C C C C C C C C C C C H H H H H H H H H H H H H H H H H H H H H H
charge: 0
multiplicity: 1
keywords: wb97x-d3
keywords: def2-TZVPP
keywords: def2/J RIJCOSX
keywords: DEFGRID2
keywords: scfconv7
keywords: smallprint printgap noloewdin
keywords: NOSOSCF
formula: C17H22N2O4
InChI: InChI=1/C17H22N2O4/c1-6-7-18-9-13(20)19(16(18)22)10-23-15(21)14-12(8-11(2)3)17(14,4)5/h1,8,12,14H,7,9-10H2,2-5H3
45 atoms
O  -0.224645 -0.792306 0.137754
O  -1.635826 -0.738946 -1.605101
O  1.477584 0.843707 -2.000106
O  3.050301 -2.11535 1.082993
N  1.985092 -0.839502 -0.529024
N  3.959488 -0.187665 0.209054
C  -2.496171 1.918158 -0.124936
C  -3.545468 0.865027 -0.003381
C  -2.112027 0.527608 0.365087
C  -2.408113 3.008807 0.914722
C  -2.078802 2.382355 -1.498754
C  -4.599189 0.895407 1.039892
C  -1.338802 -0.384906 -0.491348
C  -5.416259 -0.118741 1.337628
C  -6.476593 0.023998 2.386705
C  -5.352543 -1.460379 0.675392
C  0.742174 -1.541423 -0.580822
C  2.233678 0.31318 -1.224798
C  3.027839 -1.153714 0.35013
C  3.613603 0.760045 -0.819461
C  5.272911 -0.261213 0.796412
C  6.280396 -0.725482 -0.154971
C  7.093854 -1.088727 -0.960241
H  -3.851656 0.433145 -0.952186
H  -1.87691 0.466922 1.42175
H  -2.622862 2.653786 1.922547
H  -1.404614 3.438346 0.928145
H  -3.10774 3.816315 0.688173
H  -1.025623 2.670809 -1.512533
H  -2.232506 1.632782 -2.272088
H  -2.662408 3.261368 -1.78012
H  -4.723176 1.824585 1.588132
H  -6.466813 1.010179 2.85097
H  -7.472293 -0.139161 1.965369
H  -6.351279 -0.721695 3.176436
H  -4.557954 -1.541503 -0.064865
H  -5.193421 -2.246473 1.418432
H  -6.298539 -1.69565 0.180273
H  0.864379 -2.509727 -0.100401
H  0.4469 -1.693108 -1.616927
H  4.291407 0.711639 -1.677382
H  3.598169 1.787754 -0.450368
H  5.235789 -0.927356 1.65863
H  5.552241 0.723794 1.17578
H  7.823824 -1.422597 -1.663276
elementType: O N C H
totalener: -1071.54680759 hartree
nucrepener: 1914.90936677 hartree
electener: -2986.45617436 hartree
oneelecener: -5262.36403500 hartree
twoeener: 2275.90786063 hartree
cpcmener: -0.04028041 hartree
kineticenergy: 1066.87559893 hartree
xcener: -102.624711635406 hartree
chargesum: -0.0000000
charge: -0.281110 -0.456826 -0.449918 -0.485394 -0.116778 -0.160352 0.151873 -0.052406 -0.066886 -0.294472 -0.272459 -0.264345 0.379227 -0.018895 -0.230888 -0.247053 0.070372 0.299433 0.385682 0.007890 -0.046017 -0.425583 0.058678 0.101484 0.093679 0.089234 0.098354 0.102224 0.092035 0.095626 0.097592 0.123719 0.088092 0.094384 0.093851 0.081133 0.095836 0.097535 0.128971 0.142474 0.124321 0.122270 0.131160 0.139079 0.283172
qa: -0.2811 -0.4568 -0.4499 -0.4854 -0.1168 -0.1604 0.1519 -0.0524 -0.0669 -0.2945 -0.2725 -0.2643 0.3792 -0.0189 -0.2309 -0.2471 0.0704 0.2994 0.3857 0.0079 -0.0460 -0.4256 0.0587 0.1015 0.0937 0.0892 0.0984 0.1022 0.0920 0.0956 0.0976 0.1237 0.0881 0.0944 0.0939 0.0811 0.0958 0.0975 0.1290 0.1425 0.1243 0.1223 0.1312 0.1391 0.2832
va: 2.1075 2.0465 2.0653 2.0424 3.1221 3.1943 3.7420 3.8417 3.8065 3.9157 3.8786 3.8823 4.1623 3.7134 3.9300 3.9425 3.8726 4.1871 4.3163 3.8913 3.9032 3.7403 3.5814 1.0225 1.0317 1.0015 1.0025 0.9984 1.0078 1.0161 1.0022 1.0029 1.0072 0.9959 0.9961 1.0166 0.9978 0.9984 1.0157 1.0173 1.0047 1.0096 1.0065 0.9862 0.9484
dispcorr: -0.020818185 hartree
energy: -1071.567625774823
dipole: -30.16797 31.45183 1.28387 10.77663 -9.59061 1.18603 7.17525 -6.24819 0.92706
magnitude: 1.97849 au
magnitude: 5.02892 debye
