program: Gaussian 09
title: 000072106
version: EM64L-G09RevD.01
frameworkgroup: C1[X(C19H20F3N3O3)]
method: RPBEPBE
basis: SDD
operation: Freq
keyword: #p
keyword: freq=noraman
keyword: PBEPBE/SDD
title: #p freq=noraman PBEPBE/SDD
converged: YES YES NO NO
title: Mulliken charges:
elementType: F F F O O O N N N C C C C C C C C C C C C C C C C C C C H H H H H H H H H H H H H H H H H H H H
charge: -0.170390 -0.168881 -0.166353 -0.245510 -0.283319 -0.316510 -0.102685 -0.469229 -0.087264 -0.353550 -0.343299 -0.356966 -0.311400 -0.315341 -0.268315 0.245064 0.033227 0.099864 0.455363 -0.243913 -0.447572 0.334876 -0.458257 -0.382073 -0.183137 -0.201806 0.243985 -0.313517 0.195313 0.213920 0.205978 0.200379 0.204189 0.220802 0.216925 0.194909 0.195354 0.217460 0.233679 0.247222 0.376375 0.277503 0.346648 0.243994 0.263964 0.234638 0.237888 0.249767
chargesum: 0.00000
title: Mulliken charges with hydrogens summed into heavy atoms:
elementType: F F F O O O N N N C C C C C C C C C C C C C C C C C C C
charge: -0.170390 -0.168881 -0.166353 -0.245510 -0.283319 -0.316510 -0.102685 -0.092854 -0.087264 0.055684 0.063058 0.068025 0.100434 0.097472 0.212586 0.245064 0.033227 0.099864 0.455363 0.033591 -0.100924 0.334876 -0.214263 -0.118109 0.051501 0.036082 0.243985 -0.063750
polarizability: 3.75867193e+02 2.79723978e+01 2.81896355e+02 3.35288290e+00 -2.15429517e+00 1.35325641e+02
1716.lowfreq: -10.3665 -0.0011 0.0005 0.0012 3.5208 4.0411 8.0819 15.1398 21.7268
frequency: -8.0215 15.0384 21.4913 24.4147 31.3064 51.2693 61.7149 76.0638 92.6477 109.8708 117.0438 121.1707 130.4186 151.2847 180.0152 201.6562 224.7852 238.4022 260.8470 282.0484 286.8642 309.0801 310.3459 329.3701 332.6792 367.2953 383.7533 395.9957 414.6600 430.9399 438.3278 453.3073 470.3076 487.1144 512.4340 525.8027 526.9356 578.8749 600.4771 608.1911 626.1425 649.7445 683.7176 692.4859 700.8354 705.1837 757.4666 768.9076 790.3539 800.5753 800.8823 811.8870 815.4994 842.5194 853.0362 887.1940 896.0798 904.4261 917.6454 923.3406 957.3432 958.3828 981.3209 983.9293 985.1668 985.3284 1000.1285 1016.3131 1025.5936 1028.2912 1050.4705 1054.9574 1057.8182 1062.0428 1082.6009 1092.7705 1108.0333 1112.5652 1128.4609 1139.1591 1151.4934 1185.8886 1189.0780 1189.1579 1205.6607 1216.0576 1252.2625 1263.9775 1269.5549 1286.5189 1289.2608 1294.8012 1305.0157 1318.8307 1331.2984 1336.3834 1348.7445 1355.0752 1364.8584 1370.8341 1390.4253 1398.4637 1413.6486 1435.7902 1444.3281 1447.5473 1451.7674 1453.9881 1459.0466 1469.0859 1473.8504 1482.4728 1511.8542 1559.1233 1589.3073 1595.2098 1619.6748 1647.1869 2868.6327 2875.3732 2902.5382 2956.7245 2960.5594 3023.5956 3031.1148 3035.1121 3045.4259 3083.2713 3086.5009 3098.8791 3127.0690 3131.8736 3154.8995 3167.2477 3178.1320 3187.0519 3189.1674 3240.1408
redmass: 3.0608 8.0254 13.3754 7.1252 5.8414 5.4464 5.6347 5.3436 5.6271 3.8084 6.3891 4.7284 6.7107 3.6521 5.2436 6.4446 4.8441 1.9350 4.6072 5.4215 4.8622 6.7849 4.2142 4.2095 4.5176 9.0911 2.3329 5.4988 3.3631 5.3872 4.8360 6.8074 2.7526 4.8962 8.5965 7.5912 3.1360 7.5419 1.9747 11.7250 5.7850 6.5740 7.2274 6.3422 2.1823 7.7537 3.6970 2.7280 1.2426 5.5405 1.5218 1.8080 4.1641 1.6049 6.4764 1.2224 3.4155 3.6551 1.3530 6.4047 1.4784 1.4980 1.5062 4.7232 3.1511 1.6115 2.6948 6.1183 3.4683 2.9880 2.4572 2.9705 1.7665 2.3633 2.7649 3.5129 2.3372 1.7341 1.9232 2.4524 1.7441 1.4692 1.2423 1.0675 1.3291 2.4218 1.3374 2.0484 1.3057 2.0784 1.2893 1.3041 1.8274 1.4473 2.0838 1.7525 1.3802 2.3726 1.4775 1.2737 3.4368 1.6535 3.5542 2.7107 1.0825 1.0800 1.0981 3.6805 1.0985 1.0874 2.5455 1.0854 4.7080 7.9484 4.7586 6.7867 6.3463 1.8203 1.0703 1.0691 1.0697 1.0665 1.0665 1.0595 1.0893 1.0899 1.0893 1.0964 1.0981 1.1083 1.0893 1.0905 1.0917 1.0902 1.0976 1.0994 1.0934 1.0807
irintensity: 0.0256 0.5015 0.2880 0.2685 0.0132 2.3191 0.9037 0.2975 0.3750 0.6549 0.4249 0.0395 0.4622 5.8392 0.8019 3.6065 0.7784 3.6243 8.1946 3.9609 0.5086 2.1824 8.0543 12.3176 5.9172 12.7381 10.0155 0.6230 31.2994 0.3363 1.7609 5.3282 0.8543 2.5896 4.1600 0.4491 9.5359 8.1785 5.3890 30.8052 2.6992 14.9910 6.9109 14.1552 20.4501 21.5383 10.7290 36.8084 0.8552 16.1642 8.1687 53.2560 5.9356 0.3381 27.1579 86.0291 7.7723 3.1739 18.0341 76.2751 59.3647 57.4635 7.0887 11.6272 121.2876 23.0959 21.2469 134.7412 198.1236 103.1882 20.0137 19.7765 6.9576 87.0711 18.7309 64.4316 7.5003 5.6944 261.4138 61.0164 1.9982 20.7622 15.7206 3.5087 10.1683 365.7307 18.5416 329.8783 29.1682 202.8107 51.4917 3.4930 105.2401 20.5696 12.7810 13.4834 21.5975 26.2065 4.7012 3.7338 20.7113 8.6224 181.1373 60.1239 2.8732 0.5849 18.4246 191.3319 3.8823 2.5285 38.7563 10.5554 183.9042 175.3948 173.3038 491.7790 80.7684 185.0500 48.8262 97.6250 91.3164 27.7098 99.0628 14.8398 38.7448 35.5789 22.5982 39.2505 35.7882 27.9630 7.8476 17.4938 9.5729 4.4566 4.8058 12.7963 22.1672 226.8798
temp: 298.150 k
press: 1.00000 atm
elementType: 9 9 9 8 8 8 7 7 7 6 6 6 6 6 6 6 6 6 6 6 6 6 6 6 6 6 6 6 1 1 1 1 1 1 1 1 1 1 1 1 1 1 1 1 1 1 1 1
symmnumber: 1
zpe: 966006.5 jmol-1
zpe.correction: 0.367932 hartree
zpe.thermalcorrener: 0.392432 hartree
zpe.thermalcorrenthalpy: 0.393377 hartree
zpe.thermalcorrgfe: 0.310395 hartree
zpe.sumelectzpe: -1423.412758 hartree
zpe.sumelectthermal: -1423.388258 hartree
zpe.sumelectthermalent: -1423.387314 hartree
zpe.sumelectthermalfe: -1423.470295 hartree
dipole: 6.1217 0.8548 0.1740
dipole: 6.1835
quadrupole: -213.3284 -143.0731 -163.1277
quadrupole: 14.9793 5.3079 0.8372
quadrupole: -40.1520 30.1033 10.0487 14.9793 5.3079 0.8372
hfenergy: -1423.7806905 hartree
pointgroup: C01 [X(C19H20F3N3O3)]
dipole: -2.4145693 -0.2720906 0.1193406 debye
polarizability: 377.0409421|25.4626296|280.4916343|-8.3814913|1.2634477|135.5566123 unknown
InChI: InChI=1S/C19H20F3N3O3/c20-19(21,22)14-3-1-4-15(13-14)24-17-16(5-2-6-23-17)18(26)28-12-9-25-7-10-27-11-8-25/h1-6,13,24H,7-12H2
charge 0 multiplicity 1
48 atoms
F  7.701471 0.788263 -0.841626
F  7.115314 -0.250719 1.081846
F  6.548198 -1.166647 -0.908602
O  -8.697577 1.432062 -0.195105
O  -2.50139 -0.844016 -0.003654
O  -0.968037 0.900272 -0.004968
N  -6.042574 0.337938 0.22263
N  1.629627 0.253275 -0.128643
N  2.198524 -2.054479 -0.259631
C  -7.213486 -0.175386 0.980147
C  -6.468164 0.839317 -1.110725
C  -4.906379 -0.608281 0.161569
C  -8.264538 0.938245 1.12273
C  -7.532547 1.936068 -0.940753
C  -3.588289 0.17431 0.114465
C  -1.204481 -0.350096 -0.046957
C  -0.175439 -1.402682 -0.140642
C  1.240146 -1.073145 -0.177963
C  2.913271 0.845975 -0.135617
C  -0.538961 -2.771442 -0.193868
C  4.135144 0.125951 -0.206429
C  5.353335 0.839251 -0.207416
C  2.94886 2.269417 -0.064792
C  5.395021 2.250737 -0.138447
C  4.175308 2.958133 -0.069128
C  0.450964 -3.767307 -0.279856
C  6.643371 0.069902 -0.227761
C  1.803687 -3.350877 -0.308471
H  -7.683144 -1.054544 0.47222
H  -6.880796 -0.495159 1.98546
H  -5.596879 1.259681 -1.646645
H  -6.889784 0.012647 -1.736218
H  -4.965074 -1.299175 -0.713054
H  -4.912241 -1.235779 1.071255
H  -9.178154 0.563125 1.612517
H  -7.837877 1.776127 1.71519
H  -7.08902 2.80235 -0.404429
H  -7.926206 2.26373 -1.91691
H  -3.527006 0.856594 -0.751707
H  -3.437021 0.763332 1.034564
H  0.82004 0.901623 -0.072261
H  -1.600919 -3.029317 -0.166022
H  4.102358 -0.962684 -0.266537
H  2.007648 2.829826 -0.009826
H  6.351991 2.779565 -0.150109
H  4.181823 4.051542 -0.018582
H  0.194714 -4.828694 -0.322843
H  2.614668 -4.085727 -0.373499
