program: Orca
programVersion: 5.0.2
elementType: O O O O N N C C C C C C C C C C C C C C C C C H H H H H H H H H H H H H H H H H H H H H H
charge: 0
multiplicity: 1
keywords: wb97x-d3
keywords: def2-TZVPP
keywords: def2/J RIJCOSX
keywords: DEFGRID2
keywords: scfconv7
keywords: smallprint printgap noloewdin
keywords: NOSOSCF
formula: C17H22N2O4
InChI: InChI=1/C17H22N2O4/c1-6-7-18-9-13(20)19(16(18)22)10-23-15(21)14-12(8-11(2)3)17(14,4)5/h1,8,12,14H,7,9-10H2,2-5H3
45 atoms
O  -0.176163 -0.777045 -0.61226
O  -1.287496 0.534712 -2.05577
O  1.742268 1.639046 -1.191741
O  3.014162 -2.677263 -0.483991
N  2.09616 -0.621148 -1.031334
N  4.110711 -0.682042 -0.137721
C  -2.304657 1.863495 0.596827
C  -3.366238 0.978547 0.037058
C  -1.962567 0.423701 0.235306
C  -2.287263 2.174626 2.074509
C  -1.789714 3.006588 -0.244068
C  -4.491429 0.448137 0.840595
C  -1.140238 0.101765 -0.940117
C  -5.42207 -0.401027 0.394656
C  -6.541545 -0.855987 1.280956
C  -5.439314 -0.970746 -0.990459
C  0.841495 -1.070175 -1.552742
C  2.43003 0.69782 -0.881962
C  3.088378 -1.470809 -0.526117
C  3.799473 0.718892 -0.25554
C  5.293963 -1.171747 0.520118
C  5.242028 -1.008878 1.971791
C  5.21084 -0.863407 3.163492
H  -3.599185 1.177099 -1.004685
H  -1.820163 -0.236052 1.083578
H  -2.98129 2.985437 2.305659
H  -2.554456 1.319191 2.694463
H  -1.290647 2.498387 2.380487
H  -1.911648 2.845678 -1.31263
H  -2.335404 3.917746 0.009989
H  -0.731877 3.193825 -0.048242
H  -4.564899 0.785535 1.870077
H  -6.489215 -0.409655 2.274124
H  -7.513634 -0.602454 0.849031
H  -6.532113 -1.942982 1.399167
H  -4.573151 -0.691462 -1.588264
H  -5.473639 -2.062772 -0.952669
H  -6.336203 -0.655415 -1.530994
H  0.887196 -2.148212 -1.688042
H  0.649322 -0.598595 -2.514366
H  4.509691 1.25121 -0.893151
H  3.763251 1.222495 0.71503
H  6.163852 -0.642219 0.125096
H  5.429493 -2.223628 0.26659
H  5.188387 -0.742143 4.223576
elementType: O N C H
totalener: -1071.54663731 hartree
nucrepener: 1920.44852166 hartree
electener: -2991.99515897 hartree
oneelecener: -5273.62335851 hartree
twoeener: 2281.62819954 hartree
cpcmener: -0.04124181 hartree
kineticenergy: 1066.86540527 hartree
xcener: -102.623766047885 hartree
chargesum: -0.0000000
charge: -0.283650 -0.456642 -0.451221 -0.486695 -0.111862 -0.157975 0.143642 -0.051234 -0.053928 -0.293241 -0.273481 -0.252675 0.378049 -0.023419 -0.231160 -0.253181 0.064516 0.298657 0.387070 0.008376 -0.062005 -0.426948 0.070329 0.101321 0.092549 0.103248 0.087522 0.098995 0.095594 0.096950 0.092483 0.121448 0.088126 0.093819 0.093890 0.083310 0.094505 0.098486 0.129061 0.144023 0.121808 0.125616 0.140329 0.132094 0.283500
qa: -0.2837 -0.4566 -0.4512 -0.4867 -0.1119 -0.1580 0.1436 -0.0512 -0.0539 -0.2932 -0.2735 -0.2527 0.3780 -0.0234 -0.2312 -0.2532 0.0645 0.2987 0.3871 0.0084 -0.0620 -0.4269 0.0703 0.1013 0.0925 0.1032 0.0875 0.0990 0.0956 0.0969 0.0925 0.1214 0.0881 0.0938 0.0939 0.0833 0.0945 0.0985 0.1291 0.1440 0.1218 0.1256 0.1403 0.1321 0.2835
va: 2.1062 2.0479 2.0649 2.0414 3.1162 3.1928 3.7538 3.8431 3.7986 3.9171 3.8799 3.8879 4.1698 3.7207 3.9305 3.9451 3.8778 4.1925 4.3129 3.8904 3.9009 3.7431 3.5708 1.0190 1.0325 0.9984 1.0024 1.0019 1.0172 1.0018 1.0076 1.0058 1.0077 0.9952 0.9963 1.0149 0.9979 0.9971 1.0166 1.0148 1.0070 1.0063 0.9854 1.0045 0.9480
dispcorr: -0.020684570 hartree
energy: -1071.567321879730
dipole: -30.11844 31.41531 1.29687 7.65313 -7.36071 0.29241 8.60283 -7.39354 1.20929
magnitude: 1.79715 au
magnitude: 4.56800 debye
