program: Orca
programVersion: 5.0.2
elementType: O O O O N N C C C C C C C C C C C C C C C C C H H H H H H H H H H H H H H H H H H H H H H
charge: 0
multiplicity: 1
keywords: wb97x-d3
keywords: def2-TZVPP
keywords: def2/J RIJCOSX
keywords: DEFGRID2
keywords: scfconv7
keywords: smallprint printgap noloewdin
keywords: NOSOSCF
formula: C17H22N2O4
InChI: InChI=1/C17H22N2O4/c1-6-7-18-9-13(20)19(16(18)22)10-23-15(21)14-12(8-11(2)3)17(14,4)5/h1,8,12,14H,7,9-10H2,2-5H3
45 atoms
O  0.363911 1.336717 0.334287
O  -0.670355 0.796561 2.24923
O  3.624921 2.581552 -0.886724
O  1.99949 -1.23391 0.996803
N  2.61929 0.871458 0.278204
N  3.734696 -0.875067 -0.480457
C  -2.320223 -0.962688 0.202153
C  -3.148774 0.183283 0.703511
C  -1.766166 0.453769 0.148882
C  -2.639301 -1.594554 -1.131023
C  -1.785682 -1.956095 1.204704
C  -4.331637 0.680522 -0.027932
C  -0.671363 0.863676 1.04561
C  -5.539227 0.937678 0.48625
C  -6.656653 1.42222 -0.389289
C  -5.91226 0.770718 1.927689
C  1.600567 1.58238 0.98417
C  3.509991 1.414055 -0.611173
C  2.716144 -0.523331 0.32856
C  4.311078 0.258906 -1.154931
C  4.081279 -2.236911 -0.796857
C  3.691723 -2.6038 -2.156665
C  3.38668 -2.886697 -3.283036
H  -3.207145 0.238288 1.785319
H  -1.715756 0.881584 -0.84671
H  -3.45405 -2.314692 -1.028978
H  -2.93126 -0.869084 -1.889169
H  -1.769726 -2.133179 -1.512848
H  -0.82487 -2.362755 0.882007
H  -1.656776 -1.537997 2.200703
H  -2.481616 -2.792856 1.292917
H  -4.198024 0.842403 -1.093752
H  -6.351888 1.527106 -1.430655
H  -7.506778 0.735201 -0.356109
H  -7.032313 2.391316 -0.049455
H  -6.314347 1.703406 2.331919
H  -6.705168 0.0251 2.032967
H  -5.086898 0.462665 2.566481
H  1.822546 2.646784 0.939175
H  1.578364 1.267203 2.025238
H  4.197264 0.201889 -2.241421
H  5.372675 0.383985 -0.926547
H  3.598187 -2.897926 -0.076488
H  5.158342 -2.375836 -0.67622
H  3.112217 -3.141611 -4.282753
elementType: O N C H
totalener: -1071.54785967 hartree
nucrepener: 1925.66259025 hartree
electener: -2997.21044991 hartree
oneelecener: -5284.00350563 hartree
twoeener: 2286.79305572 hartree
cpcmener: -0.04082968 hartree
kineticenergy: 1066.85760080 hartree
xcener: -102.622785154792 hartree
chargesum: 0.0000000
charge: -0.280701 -0.450337 -0.448285 -0.489530 -0.117227 -0.146430 0.107578 0.034939 -0.086700 -0.268737 -0.275585 -0.274267 0.376809 -0.051297 -0.216633 -0.249050 0.072330 0.298788 0.390241 -0.002610 -0.049706 -0.428861 0.063572 0.093736 0.090802 0.097641 0.087336 0.097642 0.091352 0.094524 0.098395 0.116396 0.087525 0.092455 0.092622 0.094055 0.096025 0.089351 0.127099 0.142508 0.123661 0.123673 0.130658 0.141040 0.283202
qa: -0.2807 -0.4503 -0.4483 -0.4895 -0.1172 -0.1464 0.1076 0.0349 -0.0867 -0.2687 -0.2756 -0.2743 0.3768 -0.0513 -0.2166 -0.2490 0.0723 0.2988 0.3902 -0.0026 -0.0497 -0.4289 0.0636 0.0937 0.0908 0.0976 0.0873 0.0976 0.0914 0.0945 0.0984 0.1164 0.0875 0.0925 0.0926 0.0941 0.0960 0.0894 0.1271 0.1425 0.1237 0.1237 0.1307 0.1410 0.2832
va: 2.1057 2.0594 2.0734 2.0288 3.1154 3.1940 3.6954 3.7868 3.8227 3.9089 3.8965 3.8718 4.1955 3.7689 3.9208 3.9407 3.8693 4.2027 4.2966 3.8947 3.8941 3.7488 3.5760 1.0313 1.0348 1.0021 1.0062 1.0023 1.0106 1.0172 1.0012 1.0111 1.0090 0.9961 0.9965 0.9971 0.9969 1.0107 1.0139 1.0170 1.0073 1.0058 1.0084 0.9849 0.9483
dispcorr: -0.020614785 hartree
energy: -1071.568474451087
dipole: -34.00600 34.93036 0.92436 -6.50097 5.52751 -0.97347 -0.92111 -0.58196 -1.50308
magnitude: 2.01527 au
magnitude: 5.12241 debye
