program: Orca
programVersion: 5.0.2
elementType: O O O O N N C C C C C C C C C C C C C C C C C H H H H H H H H H H H H H H H H H H H H H H
charge: 0
multiplicity: 1
keywords: wb97x-d3
keywords: def2-TZVPP
keywords: def2/J RIJCOSX
keywords: DEFGRID2
keywords: scfconv7
keywords: smallprint printgap noloewdin
keywords: NOSOSCF
formula: C17H22N2O4
InChI: InChI=1/C17H22N2O4/c1-6-7-18-9-13(20)19(16(18)22)10-23-15(21)14-12(8-11(2)3)17(14,4)5/h1,8,12,14H,7,9-10H2,2-5H3
45 atoms
O  0.33632 1.985635 0.891204
O  0.254316 -0.055706 1.80074
O  3.422614 -0.073718 2.146345
O  1.872898 1.837024 -1.690342
N  2.493561 1.141551 0.425417
N  3.309499 0.071733 -1.328677
C  -2.083067 0.070049 -0.467985
C  -2.566561 -0.329652 0.899266
C  -1.691428 0.880396 0.757423
C  -3.047523 0.728812 -1.420604
C  -1.052418 -0.789914 -1.157259
C  -3.982567 -0.160775 1.315843
C  -0.292766 0.851351 1.225603
C  -4.924805 -1.102282 1.218544
C  -6.325641 -0.855722 1.689193
C  -4.677528 -2.461245 0.639682
C  1.720961 2.09573 1.16502
C  3.234405 0.124498 0.973727
C  2.495362 1.089226 -0.97129
C  3.772922 -0.671954 -0.185724
C  3.358635 -0.45813 -2.66806
C  2.427887 -1.5702 -2.855793
C  1.668008 -2.492833 -2.973623
H  -2.065189 -1.204029 1.305568
H  -2.167636 1.853743 0.828776
H  -3.618651 -0.023459 -1.969632
H  -3.761353 1.376609 -0.912124
H  -2.512084 1.336495 -2.153001
H  -1.546218 -1.554354 -1.761128
H  -0.437016 -0.191577 -1.832545
H  -0.388475 -1.306009 -0.464266
H  -4.258692 0.802315 1.736414
H  -7.042041 -0.980904 0.872729
H  -6.613009 -1.572819 2.462877
H  -6.453043 0.14696 2.097761
H  -4.879778 -3.242436 1.377427
H  -5.354284 -2.648917 -0.198186
H  -3.659318 -2.598367 0.278745
H  1.987612 3.108351 0.872486
H  1.93873 1.96466 2.224854
H  4.86239 -0.735276 -0.142944
H  3.36693 -1.688122 -0.156432
H  4.376781 -0.789221 -2.881984
H  3.137613 0.342276 -3.374704
H  0.99079 -3.30911 -3.091128
elementType: O N C H
totalener: -1071.54593704 hartree
nucrepener: 2000.69754107 hartree
electener: -3072.24347811 hartree
oneelecener: -5434.24857437 hartree
twoeener: 2362.00509626 hartree
cpcmener: -0.04276969 hartree
kineticenergy: 1066.87652040 hartree
xcener: -102.624524284714 hartree
chargesum: -0.0000000
charge: -0.270182 -0.442562 -0.441460 -0.479984 -0.112643 -0.147905 0.160189 -0.028616 -0.127121 -0.275970 -0.311185 -0.252724 0.393342 -0.039394 -0.228700 -0.247306 0.070914 0.295255 0.350160 -0.004673 -0.030450 -0.416872 0.034848 0.099784 0.101136 0.096569 0.092534 0.102316 0.105718 0.091503 0.094897 0.119228 0.093486 0.094234 0.088899 0.101155 0.095692 0.085819 0.150271 0.134989 0.123253 0.126279 0.138881 0.133046 0.283348
qa: -0.2702 -0.4426 -0.4415 -0.4800 -0.1126 -0.1479 0.1602 -0.0286 -0.1271 -0.2760 -0.3112 -0.2527 0.3933 -0.0394 -0.2287 -0.2473 0.0709 0.2953 0.3502 -0.0047 -0.0304 -0.4169 0.0348 0.0998 0.1011 0.0966 0.0925 0.1023 0.1057 0.0915 0.0949 0.1192 0.0935 0.0942 0.0889 0.1012 0.0957 0.0858 0.1503 0.1350 0.1233 0.1263 0.1389 0.1330 0.2833
va: 2.1173 2.0725 2.0772 2.0372 3.0905 3.1900 3.7140 3.8255 3.8400 3.8974 3.8927 3.8529 4.2402 3.7099 3.9283 3.9361 3.8871 4.2051 4.3455 3.8917 3.8992 3.7337 3.6162 1.0237 1.0318 1.0010 1.0023 1.0031 1.0008 1.0102 1.0090 1.0071 0.9964 0.9954 1.0077 0.9986 0.9978 1.0090 0.9923 1.0165 1.0089 1.0049 0.9869 1.0042 0.9494
dispcorr: -0.024173141 hartree
energy: -1071.570110182361
dipole: -31.69741 31.88568 0.18827 -10.46307 9.92547 -0.53760 -4.47007 3.04031 -1.42976
magnitude: 1.53905 au
magnitude: 3.91195 debye
