program: Orca
programVersion: 5.0.2
elementType: O O O O N N C C C C C C C C C C C C C C C C C H H H H H H H H H H H H H H H H H H H H H H
charge: 0
multiplicity: 1
keywords: wb97x-d3
keywords: def2-TZVPP
keywords: def2/J RIJCOSX
keywords: DEFGRID2
keywords: scfconv7
keywords: smallprint printgap noloewdin
keywords: NOSOSCF
formula: C17H22N2O4
InChI: InChI=1/C17H22N2O4/c1-6-7-18-9-13(20)19(16(18)22)10-23-15(21)14-12(8-11(2)3)17(14,4)5/h1,8,12,14H,7,9-10H2,2-5H3
45 atoms
O  0.338814 1.379542 1.328378
O  -0.260261 -0.737906 0.935386
O  2.167284 2.383371 -0.941062
O  2.720113 -1.687116 1.035908
N  2.289067 0.485475 0.343205
N  3.03692 -0.980519 -1.129499
C  -2.460089 0.998252 -0.648984
C  -3.051286 0.133952 0.429095
C  -1.875969 1.021842 0.754014
C  -3.185483 2.245218 -1.090638
C  -1.699467 0.328477 -1.767015
C  -4.361552 0.419369 1.048518
C  -0.55134 0.42955 1.012886
C  -5.377708 -0.438377 1.187262
C  -6.650609 -0.015563 1.857629
C  -5.368354 -1.859033 0.711768
C  1.686319 0.993071 1.538852
C  2.439827 1.216749 -0.804643
C  2.688943 -0.846838 0.168539
C  2.999765 0.273235 -1.836358
C  3.703051 -2.148361 -1.646889
C  5.159486 -2.023845 -1.61619
C  6.355425 -1.911363 -1.604099
H  -2.79902 -0.916525 0.332407
H  -2.078983 1.929151 1.314017
H  -3.950526 1.99872 -1.830027
H  -3.675146 2.766881 -0.269249
H  -2.490923 2.947207 -1.556437
H  -1.258255 -0.623757 -1.476692
H  -2.370564 0.130431 -2.605138
H  -0.897117 0.972648 -2.135639
H  -4.498055 1.426084 1.433481
H  -7.50417 -0.117472 1.181784
H  -6.866989 -0.647035 2.723711
H  -6.614238 1.019363 2.198379
H  -5.527192 -2.546656 1.547093
H  -6.190387 -2.032505 0.011902
H  -4.446883 -2.152271 0.21211
H  2.193683 1.900168 1.85855
H  1.776058 0.241851 2.322881
H  2.353657 0.236164 -2.716535
H  3.993479 0.606276 -2.151214
H  3.368772 -2.319081 -2.672208
H  3.389954 -3.019418 -1.070048
H  7.41855 -1.819894 -1.583358
elementType: O N C H
totalener: -1071.54742609 hartree
nucrepener: 1952.80148520 hartree
electener: -3024.34891129 hartree
oneelecener: -5338.24458426 hartree
twoeener: 2313.89567297 hartree
cpcmener: -0.04383057 hartree
kineticenergy: 1066.87041451 hartree
xcener: -102.624030328866 hartree
chargesum: -0.0000000
charge: -0.272864 -0.449334 -0.447908 -0.477240 -0.123462 -0.153806 0.118063 0.033212 -0.114728 -0.267412 -0.277712 -0.278359 0.395285 -0.046636 -0.219909 -0.250616 0.070641 0.285333 0.378519 -0.000110 -0.054772 -0.432281 0.068276 0.090524 0.094552 0.097364 0.087285 0.098108 0.091043 0.101220 0.095301 0.117404 0.092932 0.092888 0.087528 0.095752 0.094596 0.089972 0.148890 0.136566 0.121075 0.127830 0.139840 0.133256 0.283893
qa: -0.2729 -0.4493 -0.4479 -0.4772 -0.1235 -0.1538 0.1181 0.0332 -0.1147 -0.2674 -0.2777 -0.2784 0.3953 -0.0466 -0.2199 -0.2506 0.0706 0.2853 0.3785 -0.0001 -0.0548 -0.4323 0.0683 0.0905 0.0946 0.0974 0.0873 0.0981 0.0910 0.1012 0.0953 0.1174 0.0929 0.0929 0.0875 0.0958 0.0946 0.0900 0.1489 0.1366 0.1211 0.1278 0.1398 0.1333 0.2839
va: 2.1180 2.0635 2.0666 2.0484 3.0975 3.1710 3.7027 3.7880 3.8286 3.9020 3.9042 3.8702 4.2144 3.7612 3.9230 3.9417 3.8931 4.2005 4.3259 3.9059 3.9077 3.7491 3.5705 1.0333 1.0341 1.0018 1.0057 1.0022 1.0157 1.0018 1.0039 1.0105 0.9964 0.9960 1.0091 0.9968 0.9974 1.0100 0.9923 1.0170 1.0066 1.0051 0.9860 1.0033 0.9477
dispcorr: -0.021719628 hartree
energy: -1071.569145715935
dipole: -34.45966 34.36453 -0.09513 -0.01661 0.28883 0.27222 -4.20794 2.74449 -1.46345
magnitude: 1.49159 au
magnitude: 3.79133 debye
