program: Orca
programVersion: 5.0.2
elementType: O O O O N N C C C C C C C C C C C C C C C C C H H H H H H H H H H H H H H H H H H H H H H
charge: 0
multiplicity: 1
keywords: wb97x-d3
keywords: def2-TZVPP
keywords: def2/J RIJCOSX
keywords: DEFGRID2
keywords: scfconv7
keywords: smallprint printgap noloewdin
keywords: NOSOSCF
formula: C17H22N2O4
InChI: InChI=1/C17H22N2O4/c1-6-7-18-9-13(20)19(16(18)22)10-23-15(21)14-12(8-11(2)3)17(14,4)5/h1,8,12,14H,7,9-10H2,2-5H3
45 atoms
O  0.375093 1.015749 0.70139
O  -0.730247 2.305247 -0.764282
O  1.583246 0.136553 -2.182789
O  3.722469 0.207418 1.836246
N  2.483831 0.477342 -0.102143
N  4.060608 -1.063871 -0.05386
C  -3.091315 1.433692 1.187519
C  -3.230323 0.829022 -0.178387
C  -1.91487 0.702999 0.557896
C  -3.730951 0.752326 2.371988
C  -3.07879 2.937542 1.307612
C  -4.032774 -0.384581 -0.437245
C  -0.732431 1.435265 0.069768
C  -4.999767 -0.512412 -1.352208
C  -5.728633 -1.811431 -1.523297
C  -5.447054 0.575987 -2.280622
C  1.636699 1.545018 0.325017
C  2.373538 -0.145116 -1.317487
C  3.468089 -0.114088 0.698501
C  3.417573 -1.230529 -1.331917
C  5.054816 -1.974793 0.451412
C  4.488329 -3.25597 0.870423
C  4.025774 -4.308905 1.216229
H  -3.213961 1.558185 -0.981243
H  -1.693373 -0.261843 1.001992
H  -3.683935 -0.334457 2.313949
H  -3.237971 1.053293 3.298515
H  -4.783174 1.033874 2.45174
H  -4.096339 3.301021 1.465202
H  -2.48109 3.258445 2.163699
H  -2.691765 3.437026 0.421537
H  -3.802079 -1.250385 0.177256
H  -6.798047 -1.691479 -1.32917
H  -5.642348 -2.177252 -2.550269
H  -5.35162 -2.58832 -0.857884
H  -4.991932 1.544146 -2.078118
H  -5.223983 0.314498 -3.319212
H  -6.531244 0.705053 -2.223808
H  1.543772 2.280086 -0.471771
H  2.082034 2.020103 1.196209
H  2.940608 -2.209891 -1.435661
H  4.108726 -1.094412 -2.167054
H  5.571306 -1.505499 1.289478
H  5.807501 -2.14141 -0.321967
H  3.615466 -5.24441 1.525318
elementType: O N C H
totalener: -1071.54807737 hartree
nucrepener: 1898.39971484 hartree
electener: -2969.94779220 hartree
oneelecener: -5229.42799158 hartree
twoeener: 2259.48019937 hartree
cpcmener: -0.04294599 hartree
kineticenergy: 1066.86004443 hartree
xcener: -102.622224708838 hartree
chargesum: -0.0000000
charge: -0.277743 -0.454200 -0.446056 -0.485895 -0.118131 -0.159567 0.108337 0.043795 -0.133700 -0.264065 -0.275772 -0.280446 0.417864 -0.038234 -0.221059 -0.254676 0.064579 0.296459 0.387190 0.006840 -0.064056 -0.424432 0.067919 0.089100 0.093376 0.087716 0.098242 0.097192 0.096952 0.098443 0.092391 0.116824 0.093551 0.092701 0.087737 0.091159 0.098446 0.092947 0.141691 0.130834 0.125286 0.123109 0.132162 0.141740 0.283449
qa: -0.2777 -0.4542 -0.4461 -0.4859 -0.1181 -0.1596 0.1083 0.0438 -0.1337 -0.2641 -0.2758 -0.2804 0.4179 -0.0382 -0.2211 -0.2547 0.0646 0.2965 0.3872 0.0068 -0.0641 -0.4244 0.0679 0.0891 0.0934 0.0877 0.0982 0.0972 0.0970 0.0984 0.0924 0.1168 0.0936 0.0927 0.0877 0.0912 0.0984 0.0929 0.1417 0.1308 0.1253 0.1231 0.1322 0.1417 0.2834
va: 2.1102 2.0600 2.0740 2.0412 3.1234 3.1910 3.7111 3.7599 3.8395 3.9061 3.9082 3.8778 4.1851 3.7485 3.9240 3.9434 3.8704 4.1999 4.3155 3.8921 3.9025 3.7399 3.5743 1.0356 1.0365 1.0055 1.0024 1.0023 1.0003 1.0001 1.0171 1.0105 0.9964 0.9957 1.0090 1.0087 0.9962 0.9978 1.0190 1.0137 1.0060 1.0070 1.0038 0.9849 0.9479
dispcorr: -0.019847894 hartree
energy: -1071.567925261879
dipole: -35.64555 36.29419 0.64863 -0.46840 -1.07479 -1.54319 -0.31127 0.33174 0.02047
magnitude: 1.67409 au
magnitude: 4.25521 debye
