program: Orca
programVersion: 5.0.2
elementType: O O O O N N C C C C C C C C C C C C C C C C C H H H H H H H H H H H H H H H H H H H H H H
charge: 0
multiplicity: 1
keywords: wb97x-d3
keywords: def2-TZVPP
keywords: def2/J RIJCOSX
keywords: DEFGRID2
keywords: scfconv7
keywords: smallprint printgap noloewdin
keywords: NOSOSCF
formula: C17H22N2O4
InChI: InChI=1/C17H22N2O4/c1-6-7-18-9-13(20)19(16(18)22)10-23-15(21)14-12(8-11(2)3)17(14,4)5/h1,8,12,14H,7,9-10H2,2-5H3
45 atoms
O  0.405982 1.430716 0.014769
O  -0.932069 1.304465 -1.779669
O  3.929466 1.889078 0.921543
O  1.483309 -1.311562 -1.205286
N  2.515698 0.543731 -0.294485
N  3.347762 -1.452818 0.145504
C  -3.12813 1.876027 0.419855
C  -3.152568 0.43743 0.006624
C  -1.841181 1.061856 0.421069
C  -3.663687 2.246207 1.780602
C  -3.369772 2.93667 -0.624886
C  -3.746161 -0.627538 0.853511
C  -0.784256 1.270615 -0.583458
C  -4.973422 -1.13142 0.698279
C  -5.479116 -2.231106 1.581591
C  -5.936819 -0.659434 -0.34676
C  1.579778 1.507362 -0.779133
C  3.583784 0.805891 0.523064
C  2.362149 -0.827791 -0.52902
C  4.233111 -0.525632 0.801309
C  3.609706 -2.866674 0.064561
C  4.756177 -3.174165 -0.788341
C  5.707938 -3.416313 -1.479574
H  -3.252454 0.288929 -1.065031
H  -1.47364 0.801325 1.408021
H  -3.423151 1.506523 2.543908
H  -3.256444 3.204941 2.10767
H  -4.751277 2.343081 1.747582
H  -2.826264 3.854245 -0.389096
H  -3.086178 2.626209 -1.628263
H  -4.432906 3.185381 -0.651465
H  -3.123389 -1.024619 1.650325
H  -5.75183 -3.112176 0.994281
H  -4.739963 -2.538175 2.32151
H  -6.383402 -1.92461 2.114195
H  -5.561428 0.1765 -0.93517
H  -6.192449 -1.468233 -1.036629
H  -6.875891 -0.342681 0.114962
H  1.367711 1.322955 -1.830029
H  2.013713 2.49975 -0.672713
H  5.244538 -0.545347 0.384136
H  4.301375 -0.705991 1.876608
H  2.718118 -3.367804 -0.314239
H  3.786711 -3.259029 1.068565
H  6.551392 -3.646126 -2.09203
elementType: O N C H
totalener: -1071.54717408 hartree
nucrepener: 1901.15996279 hartree
electener: -2972.70713687 hartree
oneelecener: -5234.86877316 hartree
twoeener: 2262.16163629 hartree
cpcmener: -0.04157547 hartree
kineticenergy: 1066.86422105 hartree
xcener: -102.622258607836 hartree
chargesum: -0.0000000
charge: -0.282029 -0.456047 -0.448065 -0.485168 -0.119312 -0.148932 0.142124 -0.010664 -0.133961 -0.266223 -0.294641 -0.252385 0.415224 -0.038259 -0.229200 -0.249696 0.071381 0.297790 0.385190 -0.002717 -0.052640 -0.426382 0.062971 0.099707 0.093265 0.090839 0.098525 0.095866 0.101328 0.094327 0.095486 0.119575 0.094245 0.088688 0.094026 0.087456 0.100086 0.095055 0.142174 0.128225 0.124236 0.122503 0.130667 0.142027 0.283339
qa: -0.2820 -0.4560 -0.4481 -0.4852 -0.1193 -0.1489 0.1421 -0.0107 -0.1340 -0.2662 -0.2946 -0.2524 0.4152 -0.0383 -0.2292 -0.2497 0.0714 0.2978 0.3852 -0.0027 -0.0526 -0.4264 0.0630 0.0997 0.0933 0.0908 0.0985 0.0959 0.1013 0.0943 0.0955 0.1196 0.0942 0.0887 0.0940 0.0875 0.1001 0.0951 0.1422 0.1282 0.1242 0.1225 0.1307 0.1420 0.2833
va: 2.1057 2.0565 2.0730 2.0398 3.1208 3.1906 3.6764 3.7855 3.8689 3.9068 3.9021 3.8645 4.1799 3.7041 3.9282 3.9406 3.8657 4.2022 4.3094 3.8950 3.8977 3.7392 3.5753 1.0251 1.0366 1.0025 1.0033 1.0023 0.9995 1.0175 1.0006 1.0075 0.9954 1.0080 0.9963 1.0079 0.9983 0.9979 1.0181 1.0122 1.0044 1.0084 1.0070 0.9850 0.9483
dispcorr: -0.020386240 hartree
energy: -1071.567560319865
dipole: -36.48111 37.05037 0.56926 -0.09195 -0.92457 -1.01652 7.39300 -5.87178 1.52122
magnitude: 1.91611 au
magnitude: 4.87036 debye
