program: Orca
programVersion: 5.0.2
elementType: O O O O N N C C C C C C C C C C C C C C C C C H H H H H H H H H H H H H H H H H H H H H H
charge: 0
multiplicity: 1
keywords: wb97x-d3
keywords: def2-TZVPP
keywords: def2/J RIJCOSX
keywords: DEFGRID2
keywords: scfconv7
keywords: smallprint printgap noloewdin
keywords: NOSOSCF
formula: C17H22N2O4
InChI: InChI=1/C17H22N2O4/c1-6-7-18-9-13(20)19(16(18)22)10-23-15(21)14-12(8-11(2)3)17(14,4)5/h1,8,12,14H,7,9-10H2,2-5H3
45 atoms
O  0.393583 1.377944 0.013736
O  -0.947816 1.280997 -1.779904
O  3.905874 1.892351 0.916561
O  1.521806 -1.356561 -1.208865
N  2.515272 0.518738 -0.295397
N  3.39614 -1.459526 0.132058
C  -3.13838 1.868212 0.415675
C  -3.176073 0.429048 0.006463
C  -1.858714 1.04125 0.420596
C  -3.670801 2.247754 1.775381
C  -3.368423 2.929518 -0.630896
C  -3.782023 -0.62798 0.85563
C  -0.799103 1.237243 -0.583928
C  -5.031674 -1.082606 0.730168
C  -5.553518 -2.176898 1.610931
C  -6.006061 -0.556606 -0.278694
C  1.564107 1.464554 -0.784542
C  3.581645 0.802802 0.517719
C  2.392446 -0.855316 -0.534929
C  4.2605 -0.514946 0.791304
C  3.688536 -2.867322 0.048671
C  4.856887 -3.144475 -0.78491
C  5.82667 -3.364522 -1.458036
H  -3.275858 0.278091 -1.065129
H  -1.494606 0.78043 1.408715
H  -4.756749 2.360619 1.740751
H  -3.441982 1.505605 2.539849
H  -3.250231 3.20096 2.101673
H  -4.428708 3.189293 -0.658907
H  -2.816265 3.842202 -0.396348
H  -3.087082 2.614837 -1.633428
H  -3.150148 -1.061674 1.625715
H  -5.879447 -3.035788 1.018016
H  -4.804866 -2.525965 2.322151
H  -6.427881 -1.844184 2.176673
H  -5.612487 0.269476 -0.869082
H  -6.316842 -1.345044 -0.969505
H  -6.916397 -0.206616 0.215195
H  1.350988 1.266572 -1.832836
H  1.98472 2.463894 -0.690044
H  5.27205 -0.510448 0.374297
H  4.332597 -0.697774 1.866067
H  2.814678 -3.384521 -0.349184
H  3.855774 -3.262274 1.053562
H  6.684377 -3.565062 -2.059859
elementType: O N C H
totalener: -1071.54717963 hartree
nucrepener: 1898.22406787 hartree
electener: -2969.77124750 hartree
oneelecener: -5228.97325818 hartree
twoeener: 2259.20201068 hartree
cpcmener: -0.04132221 hartree
kineticenergy: 1066.86022272 hartree
xcener: -102.621555610822 hartree
chargesum: -0.0000000
charge: -0.281852 -0.457009 -0.447860 -0.485264 -0.118809 -0.148756 0.135382 -0.013111 -0.129037 -0.267960 -0.295091 -0.248415 0.416117 -0.040370 -0.229010 -0.248973 0.070547 0.297651 0.385207 -0.002901 -0.053099 -0.427839 0.064572 0.100418 0.093408 0.096056 0.091196 0.099162 0.095496 0.101638 0.094777 0.119703 0.094297 0.088771 0.094067 0.087171 0.100776 0.095277 0.141863 0.128805 0.124112 0.122713 0.130564 0.142219 0.283393
qa: -0.2819 -0.4570 -0.4479 -0.4853 -0.1188 -0.1488 0.1354 -0.0131 -0.1290 -0.2680 -0.2951 -0.2484 0.4161 -0.0404 -0.2290 -0.2490 0.0705 0.2977 0.3852 -0.0029 -0.0531 -0.4278 0.0646 0.1004 0.0934 0.0961 0.0912 0.0992 0.0955 0.1016 0.0948 0.1197 0.0943 0.0888 0.0941 0.0872 0.1008 0.0953 0.1419 0.1288 0.1241 0.1227 0.1306 0.1422 0.2834
va: 2.1061 2.0555 2.0731 2.0395 3.1209 3.1909 3.6783 3.7920 3.8625 3.9072 3.9010 3.8600 4.1799 3.7057 3.9282 3.9390 3.8641 4.2024 4.3089 3.8953 3.8958 3.7384 3.5739 1.0250 1.0361 1.0019 1.0025 1.0032 1.0006 0.9995 1.0176 1.0072 0.9956 1.0079 0.9962 1.0080 0.9985 0.9980 1.0183 1.0117 1.0046 1.0082 1.0075 0.9848 0.9482
dispcorr: -0.020402185 hartree
energy: -1071.567581815454
dipole: -36.72279 37.30665 0.58385 0.34165 -1.32342 -0.98176 7.51567 -6.00319 1.51248
magnitude: 1.89535 au
magnitude: 4.81759 debye
