program: Orca
programVersion: 5.0.2
elementType: O O O O N N C C C C C C C C C C C C C C C C C H H H H H H H H H H H H H H H H H H H H H H
charge: 0
multiplicity: 1
keywords: wb97x-d3
keywords: def2-TZVPP
keywords: def2/J RIJCOSX
keywords: DEFGRID2
keywords: scfconv7
keywords: smallprint printgap noloewdin
keywords: NOSOSCF
formula: C17H22N2O4
InChI: InChI=1/C17H22N2O4/c1-6-7-18-9-13(20)19(16(18)22)10-23-15(21)14-12(8-11(2)3)17(14,4)5/h1,8,12,14H,7,9-10H2,2-5H3
45 atoms
O  0.140745 0.39261 -0.180201
O  -1.033399 2.098877 -1.006158
O  1.841319 -1.550652 -2.369713
O  3.243929 0.799387 1.273603
N  2.321789 -0.113198 -0.643787
N  3.918457 -1.222617 0.401139
C  -3.009879 1.25289 1.313376
C  -3.529671 0.763142 -0.004293
C  -2.100138 0.461081 0.387371
C  -3.433122 0.542603 2.575962
C  -2.80674 2.735133 1.504302
C  -4.490302 -0.359204 -0.112113
C  -0.985283 1.092137 -0.340013
C  -5.749851 -0.270856 -0.549516
C  -6.622514 -1.486334 -0.638061
C  -6.401983 1.0055 -0.984932
C  1.302931 0.856739 -0.859653
C  2.48364 -1.248431 -1.39671
C  3.192086 -0.088066 0.454138
C  3.615198 -2.014468 -0.762888
C  5.034011 -1.499471 1.269984
C  6.31793 -1.270731 0.610589
C  7.362736 -1.09542 0.045386
H  -3.627899 1.540669 -0.755701
H  -1.89978 -0.553886 0.713779
H  -2.718749 0.72906 3.380335
H  -4.407678 0.905833 2.909281
H  -3.509707 -0.536829 2.448758
H  -1.974343 2.935929 2.182298
H  -2.618265 3.266958 0.574076
H  -3.70345 3.170915 1.949993
H  -4.124466 -1.336347 0.190862
H  -7.511973 -1.378276 -0.011383
H  -6.982904 -1.638152 -1.659281
H  -6.101382 -2.392536 -0.328726
H  -5.78446 1.887954 -0.826153
H  -6.664337 0.966882 -2.046117
H  -7.339078 1.159543 -0.443596
H  1.119317 0.952463 -1.92955
H  1.628266 1.818712 -0.464935
H  3.299641 -3.028251 -0.505145
H  4.459546 -2.081892 -1.455809
H  4.976176 -2.535673 1.610694
H  4.951612 -0.874121 2.159381
H  8.293524 -0.938651 -0.452299
elementType: O N C H
totalener: -1071.54910164 hartree
nucrepener: 1874.47055194 hartree
electener: -2946.01965358 hartree
oneelecener: -5181.15835846 hartree
twoeener: 2235.13870488 hartree
cpcmener: -0.04034147 hartree
kineticenergy: 1066.86501261 hartree
xcener: -102.621498314671 hartree
chargesum: -0.0000000
charge: -0.273214 -0.467220 -0.443708 -0.484572 -0.136464 -0.155450 0.141154 0.020007 -0.119584 -0.259875 -0.287812 -0.275054 0.398267 -0.029189 -0.225977 -0.253819 0.088591 0.296387 0.384218 -0.001764 -0.050744 -0.424435 0.060168 0.095107 0.088420 0.098156 0.095389 0.088021 0.100285 0.092785 0.094924 0.118758 0.093296 0.093491 0.088702 0.089521 0.098317 0.093494 0.131181 0.134934 0.123811 0.125927 0.141029 0.131196 0.283347
qa: -0.2732 -0.4672 -0.4437 -0.4846 -0.1365 -0.1555 0.1412 0.0200 -0.1196 -0.2599 -0.2878 -0.2751 0.3983 -0.0292 -0.2260 -0.2538 0.0886 0.2964 0.3842 -0.0018 -0.0507 -0.4244 0.0602 0.0951 0.0884 0.0982 0.0954 0.0880 0.1003 0.0928 0.0949 0.1188 0.0933 0.0935 0.0887 0.0895 0.0983 0.0935 0.1312 0.1349 0.1238 0.1259 0.1410 0.1312 0.2833
va: 2.1141 2.0396 2.0757 2.0419 3.1543 3.1901 3.6771 3.7635 3.9158 3.9063 3.9043 3.8825 4.1478 3.7167 3.9261 3.9455 3.8868 4.1999 4.3131 3.8884 3.8987 3.7393 3.5791 1.0274 1.0371 1.0028 1.0033 1.0040 0.9992 1.0185 1.0007 1.0084 0.9966 0.9953 1.0085 1.0080 0.9969 0.9981 1.0020 1.0042 1.0086 1.0047 0.9852 1.0069 0.9483
dispcorr: -0.019670674 hartree
energy: -1071.568772315756
dipole: -37.39359 38.00845 0.61486 1.69214 -3.46526 -1.77312 6.91638 -6.06862 0.84777
magnitude: 2.05930 au
magnitude: 5.23432 debye
