program: Orca
programVersion: 5.0.2
elementType: O O O O N N C C C C C C C C C C C C C C C C C H H H H H H H H H H H H H H H H H H H H H H
charge: 0
multiplicity: 1
keywords: wb97x-d3
keywords: def2-TZVPP
keywords: def2/J RIJCOSX
keywords: DEFGRID2
keywords: scfconv7
keywords: smallprint printgap noloewdin
keywords: NOSOSCF
formula: C17H22N2O4
InChI: InChI=1/C17H22N2O4/c1-6-7-18-9-13(20)19(16(18)22)10-23-15(21)14-12(8-11(2)3)17(14,4)5/h1,8,12,14H,7,9-10H2,2-5H3
45 atoms
O  0.107413 1.062304 1.109565
O  -0.412702 3.06813 0.25547
O  2.789948 -0.982775 2.302434
O  2.131482 1.631517 -1.365512
N  2.337857 0.592084 0.688882
N  3.425649 -0.248176 -1.044066
C  -2.091421 0.161172 -0.930123
C  -2.49306 -0.031514 0.503552
C  -1.98168 1.319895 0.04717
C  -3.151339 0.303293 -1.995585
C  -0.854478 -0.54658 -1.43006
C  -3.903684 -0.143256 0.927399
C  -0.698303 1.914929 0.463335
C  -4.416166 -1.039705 1.777119
C  -5.87272 -1.010105 2.133852
C  -3.637721 -2.127902 2.451337
C  1.44175 1.443764 1.405179
C  2.888773 -0.565744 1.176703
C  2.591708 0.749646 -0.677735
C  3.633155 -1.19189 0.026149
C  3.667077 -0.583858 -2.426111
C  2.658327 -1.502813 -2.952319
C  1.816955 -2.261267 -3.352126
H  -1.784704 -0.614478 1.080602
H  -2.736685 2.085622 -0.097348
H  -2.740704 0.800763 -2.876515
H  -3.513121 -0.67831 -2.309332
H  -4.012149 0.88344 -1.665713
H  -0.348568 0.042233 -2.197415
H  -0.136313 -0.773359 -0.644305
H  -1.139596 -1.49743 -1.885733
H  -4.583481 0.594008 0.50948
H  -6.009868 -0.893732 3.212495
H  -6.403586 -0.196385 1.639405
H  -6.364941 -1.947709 1.86139
H  -4.095948 -3.101262 2.257459
H  -2.597127 -2.188436 2.138127
H  -3.650268 -1.994875 3.536662
H  1.632847 2.483274 1.14887
H  1.603489 1.304265 2.471531
H  4.689931 -1.321804 0.269591
H  3.207818 -2.175328 -0.197109
H  4.658367 -1.032115 -2.510661
H  3.688412 0.331304 -3.018288
H  1.068971 -2.932095 -3.711974
elementType: O N C H
totalener: -1071.54615950 hartree
nucrepener: 1992.98753028 hartree
electener: -3064.53368979 hartree
oneelecener: -5418.24753092 hartree
twoeener: 2353.71384114 hartree
cpcmener: -0.04447221 hartree
kineticenergy: 1066.86242765 hartree
xcener: -102.622992811977 hartree
chargesum: -0.0000000
charge: -0.274562 -0.447541 -0.445522 -0.470718 -0.104980 -0.144951 0.117251 0.078978 -0.121518 -0.275745 -0.293252 -0.293765 0.406045 -0.047192 -0.220282 -0.254002 0.054823 0.301422 0.343875 -0.007963 -0.030216 -0.416385 0.034208 0.097835 0.089714 0.099135 0.095907 0.088842 0.096671 0.087762 0.100489 0.116586 0.092340 0.087513 0.093261 0.094304 0.088657 0.097399 0.144228 0.128951 0.126740 0.127238 0.139824 0.135015 0.283581
qa: -0.2746 -0.4475 -0.4455 -0.4707 -0.1050 -0.1450 0.1173 0.0790 -0.1215 -0.2757 -0.2933 -0.2938 0.4060 -0.0472 -0.2203 -0.2540 0.0548 0.3014 0.3439 -0.0080 -0.0302 -0.4164 0.0342 0.0978 0.0897 0.0991 0.0959 0.0888 0.0967 0.0878 0.1005 0.1166 0.0923 0.0875 0.0933 0.0943 0.0887 0.0974 0.1442 0.1290 0.1267 0.1272 0.1398 0.1350 0.2836
va: 2.1011 2.0599 2.0742 2.0477 3.1077 3.1745 3.7241 3.7200 3.8361 3.9089 3.9139 3.8664 4.1929 3.7664 3.9230 3.9421 3.8870 4.1847 4.3460 3.9014 3.9074 3.7345 3.6145 1.0250 1.0337 1.0011 1.0020 1.0066 1.0054 1.0056 0.9998 1.0119 0.9959 1.0092 0.9964 0.9976 1.0111 0.9962 1.0190 1.0121 1.0078 1.0042 0.9867 1.0018 0.9492
dispcorr: -0.023403782 hartree
energy: -1071.569563286340
dipole: -27.62827 28.37490 0.74663 -12.40951 10.10629 -2.30322 -0.67431 0.10790 -0.56641
magnitude: 2.48658 au
magnitude: 6.32038 debye
