program: Orca
programVersion: 5.0.2
elementType: O O O O N N C C C C C C C C C C C C C C C C C H H H H H H H H H H H H H H H H H H H H H H
charge: 0
multiplicity: 1
keywords: wb97x-d3
keywords: def2-TZVPP
keywords: def2/J RIJCOSX
keywords: DEFGRID2
keywords: scfconv7
keywords: smallprint printgap noloewdin
keywords: NOSOSCF
formula: C17H22N2O4
InChI: InChI=1/C17H22N2O4/c1-6-7-18-9-13(20)19(16(18)22)10-23-15(21)14-12(8-11(2)3)17(14,4)5/h1,8,12,14H,7,9-10H2,2-5H3
45 atoms
O  0.348602 1.401734 1.372743
O  -0.255759 -0.720955 1.019023
O  2.144296 2.374773 -0.923105
O  2.734908 -1.665725 1.104976
N  2.294048 0.496508 0.386706
N  3.06336 -0.97747 -1.065259
C  -2.44113 0.993552 -0.602289
C  -3.042704 0.149705 0.487497
C  -1.867146 1.039598 0.804357
C  -3.161313 2.234015 -1.070041
C  -1.673348 0.305542 -1.704305
C  -4.363111 0.446143 1.078436
C  -0.544559 0.448157 1.076946
C  -5.374308 -0.420973 1.18927
C  -6.6867 -0.003235 1.779106
C  -5.30455 -1.844691 0.710311
C  1.697014 1.017041 1.580015
C  2.431903 1.213594 -0.771457
C  2.706294 -0.834602 0.228426
C  2.995975 0.262141 -1.793539
C  3.691347 -2.161954 -1.59127
C  5.138184 -2.011661 -1.735979
C  6.324862 -1.877628 -1.864609
H  -2.796187 -0.90426 0.407427
H  -2.06953 1.957097 1.34778
H  -2.46217 2.927411 -1.541821
H  -3.920806 1.976379 -1.811387
H  -3.656809 2.769862 -0.26146
H  -0.865789 0.942466 -2.074677
H  -1.237679 -0.643988 -1.397448
H  -2.33786 0.098147 -2.545399
H  -4.516614 1.458613 1.44046
H  -6.929008 -0.598436 2.663736
H  -6.694679 1.048067 2.067758
H  -7.50317 -0.163034 1.069089
H  -5.483734 -1.909763 -0.366289
H  -4.337917 -2.311741 0.902603
H  -6.063752 -2.460172 1.194538
H  2.206118 1.927664 1.88683
H  1.791452 0.27465 2.371821
H  2.340863 0.198344 -2.665706
H  3.980136 0.606411 -2.125735
H  3.249867 -2.400944 -2.561367
H  3.466798 -3.001075 -0.932093
H  7.380233 -1.774798 -1.985109
elementType: O N C H
totalener: -1071.54637300 hartree
nucrepener: 1953.34902231 hartree
electener: -3024.89539532 hartree
oneelecener: -5339.31728653 hartree
twoeener: 2314.42189121 hartree
cpcmener: -0.04331670 hartree
kineticenergy: 1066.86568273 hartree
xcener: -102.623357226897 hartree
chargesum: 0.0000000
charge: -0.272690 -0.449118 -0.448114 -0.479064 -0.124027 -0.148037 0.122324 0.031270 -0.118920 -0.268917 -0.279846 -0.286751 0.394352 -0.034229 -0.215838 -0.275135 0.069996 0.283734 0.376999 0.001836 -0.052719 -0.431757 0.066454 0.092560 0.094752 0.098374 0.097611 0.087137 0.095207 0.091067 0.101009 0.117163 0.092945 0.084294 0.097128 0.106601 0.099015 0.093998 0.149010 0.136404 0.121529 0.126504 0.141550 0.130874 0.283470
qa: -0.2727 -0.4491 -0.4481 -0.4791 -0.1240 -0.1480 0.1223 0.0313 -0.1189 -0.2689 -0.2798 -0.2868 0.3944 -0.0342 -0.2158 -0.2751 0.0700 0.2837 0.3770 0.0018 -0.0527 -0.4318 0.0665 0.0926 0.0948 0.0984 0.0976 0.0871 0.0952 0.0911 0.1010 0.1172 0.0929 0.0843 0.0971 0.1066 0.0990 0.0940 0.1490 0.1364 0.1215 0.1265 0.1415 0.1309 0.2835
va: 2.1176 2.0636 2.0660 2.0468 3.0964 3.1775 3.7050 3.7897 3.8386 3.9043 3.9048 3.8688 4.2194 3.7390 3.9213 3.9362 3.8937 4.2035 4.3254 3.9044 3.9032 3.7511 3.5699 1.0273 1.0333 1.0022 1.0015 1.0060 1.0041 1.0159 1.0020 1.0096 0.9948 1.0102 0.9938 0.9939 1.0033 1.0016 0.9922 1.0170 1.0061 1.0060 0.9852 1.0071 0.9482
dispcorr: -0.021816427 hartree
energy: -1071.568189431326
dipole: -34.36677 34.27166 -0.09511 -0.15888 0.40000 0.24112 -4.59779 3.08143 -1.51636
magnitude: 1.53835 au
magnitude: 3.91019 debye
