program: Orca
programVersion: 5.0.2
elementType: O O O O N N C C C C C C C C C C C C C C C C C H H H H H H H H H H H H H H H H H H H H H H
charge: 0
multiplicity: 1
keywords: wb97x-d3
keywords: def2-TZVPP
keywords: def2/J RIJCOSX
keywords: DEFGRID2
keywords: scfconv7
keywords: smallprint printgap noloewdin
keywords: NOSOSCF
formula: C17H22N2O4
InChI: InChI=1/C17H22N2O4/c1-6-7-18-9-13(20)19(16(18)22)10-23-15(21)14-12(8-11(2)3)17(14,4)5/h1,8,12,14H,7,9-10H2,2-5H3
45 atoms
O  0.045654 0.844653 1.130258
O  -0.475165 2.934359 0.507358
O  2.781891 -1.274473 2.152131
O  2.080959 1.72733 -1.195809
N  2.296185 0.463175 0.725963
N  3.449225 -0.122983 -1.068055
C  -2.075299 0.106963 -1.023957
C  -2.526187 -0.184094 0.372532
C  -2.004385 1.203157 0.027791
C  -3.088159 0.336244 -2.120687
C  -0.81968 -0.561689 -1.532176
C  -3.944991 -0.35388 0.748685
C  -0.749841 1.760998 0.561178
C  -4.399418 -0.846143 1.90601
C  -5.871242 -0.982561 2.156785
C  -3.531414 -1.29406 3.042512
C  1.361574 1.197847 1.519695
C  2.883708 -0.723106 1.08602
C  2.567386 0.790444 -0.60577
C  3.672752 -1.180208 -0.113448
C  3.730001 -0.279497 -2.474262
C  2.767814 -1.163455 -3.131033
C  1.959264 -1.893074 -3.638097
H  -1.82692 -0.790797 0.936221
H  -2.756313 1.975295 -0.093173
H  -3.951642 0.914539 -1.793809
H  -2.629708 0.882314 -2.947465
H  -3.452315 -0.614661 -2.515487
H  -1.088294 -1.4674 -2.080446
H  -0.28228 0.089653 -2.223724
H  -0.13568 -0.86052 -0.740526
H  -4.681841 -0.042689 0.014356
H  -6.467927 -0.672848 1.298562
H  -6.13575 -2.016777 2.393903
H  -6.181205 -0.381962 3.016304
H  -2.471123 -1.101043 2.891626
H  -3.826541 -0.789884 3.966384
H  -3.653218 -2.364883 3.226765
H  1.543131 2.265333 1.417023
H  1.491552 0.913393 2.561323
H  4.728911 -1.299464 0.137881
H  3.290475 -2.144407 -0.462421
H  4.739925 -0.676306 -2.589506
H  3.726056 0.701378 -2.950499
H  1.247351 -2.537119 -4.105187
elementType: O N C H
totalener: -1071.54532173 hartree
nucrepener: 1995.74836584 hartree
electener: -3067.29368757 hartree
oneelecener: -5423.81532339 hartree
twoeener: 2356.52163582 hartree
cpcmener: -0.04419792 hartree
kineticenergy: 1066.86731800 hartree
xcener: -102.624264081757 hartree
chargesum: 0.0000000
charge: -0.277016 -0.448397 -0.446188 -0.471024 -0.105452 -0.145386 0.137048 0.018380 -0.088385 -0.299615 -0.290005 -0.279343 0.397217 -0.025094 -0.228472 -0.258609 0.057099 0.302397 0.345097 -0.006344 -0.027680 -0.414207 0.029822 0.105582 0.092783 0.090720 0.099770 0.100965 0.101236 0.093851 0.088534 0.115519 0.087990 0.092518 0.093935 0.087380 0.094006 0.097746 0.144149 0.128318 0.125534 0.126178 0.139468 0.134590 0.283388
qa: -0.2770 -0.4484 -0.4462 -0.4710 -0.1055 -0.1454 0.1370 0.0184 -0.0884 -0.2996 -0.2900 -0.2793 0.3972 -0.0251 -0.2285 -0.2586 0.0571 0.3024 0.3451 -0.0063 -0.0277 -0.4142 0.0298 0.1056 0.0928 0.0907 0.0998 0.1010 0.1012 0.0939 0.0885 0.1155 0.0880 0.0925 0.0939 0.0874 0.0940 0.0977 0.1441 0.1283 0.1255 0.1262 0.1395 0.1346 0.2834
va: 2.0943 2.0593 2.0740 2.0472 3.1093 3.1767 3.7536 3.7713 3.8019 3.9162 3.8992 3.8903 4.2008 3.7441 3.9288 3.9436 3.8819 4.1830 4.3451 3.9019 3.9091 3.7343 3.6161 1.0125 1.0300 1.0055 1.0005 0.9997 1.0001 1.0064 1.0064 1.0115 1.0083 0.9953 0.9962 1.0134 0.9974 0.9963 1.0191 1.0129 1.0082 1.0043 0.9869 1.0017 0.9492
dispcorr: -0.023498471 hartree
energy: -1071.568820204630
dipole: -26.99311 27.80407 0.81096 -10.21535 8.11226 -2.10310 -0.39710 -0.32626 -0.72336
magnitude: 2.36726 au
magnitude: 6.01710 debye
