program: Orca
programVersion: 5.0.2
elementType: O O O O N N C C C C C C C C C C C C C C C C C H H H H H H H H H H H H H H H H H H H H H H
charge: 0
multiplicity: 1
keywords: wb97x-d3
keywords: def2-TZVPP
keywords: def2/J RIJCOSX
keywords: DEFGRID2
keywords: scfconv7
keywords: smallprint printgap noloewdin
keywords: NOSOSCF
formula: C17H22N2O4
InChI: InChI=1/C17H22N2O4/c1-6-7-18-9-13(20)19(16(18)22)10-23-15(21)14-12(8-11(2)3)17(14,4)5/h1,8,12,14H,7,9-10H2,2-5H3
45 atoms
O  0.348967 1.467085 1.34886
O  -0.224867 -0.677085 1.08658
O  2.044862 2.30844 -1.050294
O  2.791746 -1.570689 1.224982
N  2.28716 0.529882 0.379192
N  3.029618 -1.026958 -0.998178
C  -2.417425 1.006749 -0.594698
C  -3.013725 0.135714 0.477366
C  -1.86662 1.048983 0.820709
C  -3.169362 2.229269 -1.058817
C  -1.614158 0.35108 -1.691132
C  -4.347632 0.403477 1.057519
C  -0.531248 0.488743 1.101167
C  -5.386999 -0.436814 1.070111
C  -6.685029 -0.042666 1.708712
C  -5.375666 -1.811873 0.475128
C  1.706608 1.112769 1.551884
C  2.364365 1.166685 -0.830005
C  2.716419 -0.802639 0.295159
C  2.908834 0.157586 -1.80618
C  3.655455 -2.235333 -1.469238
C  5.090549 -2.071534 -1.691776
C  6.266102 -1.932648 -1.894622
H  -2.740872 -0.911159 0.394429
H  -2.097479 1.955594 1.371549
H  -2.48659 2.953266 -1.508128
H  -3.906676 1.95659 -1.817022
H  -3.697766 2.734698 -0.251263
H  -0.831172 1.020543 -2.056385
H  -1.142146 -0.579873 -1.380061
H  -2.262813 0.115879 -2.537389
H  -4.482319 1.378727 1.517072
H  -7.499635 -0.049073 0.97928
H  -6.968982 -0.750279 2.492405
H  -6.641247 0.951295 2.154216
H  -5.527029 -2.569461 1.248144
H  -6.199826 -1.92779 -0.232914
H  -4.455504 -2.054171 -0.052414
H  2.208155 2.046238 1.795813
H  1.825742 0.418486 2.383109
H  2.219776 0.02288 -2.643492
H  3.871222 0.49459 -2.202798
H  3.174931 -2.548863 -2.398595
H  3.477101 -3.029632 -0.744069
H  7.310376 -1.811681 -2.077632
elementType: O N C H
totalener: -1071.54694289 hartree
nucrepener: 1957.12595046 hartree
electener: -3028.67289335 hartree
oneelecener: -5346.83742679 hartree
twoeener: 2318.16453343 hartree
cpcmener: -0.04320335 hartree
kineticenergy: 1066.87341485 hartree
xcener: -102.625129709046 hartree
chargesum: -0.0000000
charge: -0.271406 -0.446165 -0.447947 -0.479271 -0.123626 -0.145559 0.130390 0.026745 -0.123431 -0.265380 -0.280559 -0.284278 0.390346 -0.036389 -0.222812 -0.252193 0.070868 0.278540 0.375764 0.004549 -0.053716 -0.435460 0.071336 0.090764 0.096609 0.098459 0.096676 0.087657 0.093152 0.091456 0.102308 0.117835 0.093347 0.092850 0.087888 0.097828 0.093490 0.089602 0.148987 0.137209 0.121373 0.126549 0.141133 0.130866 0.283613
qa: -0.2714 -0.4462 -0.4479 -0.4793 -0.1236 -0.1456 0.1304 0.0267 -0.1234 -0.2654 -0.2806 -0.2843 0.3903 -0.0364 -0.2228 -0.2522 0.0709 0.2785 0.3758 0.0045 -0.0537 -0.4355 0.0713 0.0908 0.0966 0.0985 0.0967 0.0877 0.0932 0.0915 0.1023 0.1178 0.0933 0.0928 0.0879 0.0978 0.0935 0.0896 0.1490 0.1372 0.1214 0.1265 0.1411 0.1309 0.2836
va: 2.1181 2.0666 2.0641 2.0467 3.0973 3.1770 3.6990 3.7898 3.8423 3.8988 3.9017 3.8755 4.2221 3.7421 3.9249 3.9432 3.8920 4.2045 4.3257 3.9042 3.9020 3.7540 3.5653 1.0320 1.0339 1.0026 1.0023 1.0048 1.0071 1.0147 1.0021 1.0095 0.9965 0.9955 1.0088 0.9965 0.9976 1.0091 0.9918 1.0167 1.0058 1.0063 0.9854 1.0071 0.9480
dispcorr: -0.022073504 hartree
energy: -1071.569016398308
dipole: -34.48409 34.34096 -0.14312 -0.31414 0.47909 0.16495 -5.03766 3.52627 -1.51140
magnitude: 1.52709 au
magnitude: 3.88156 debye
