program: Orca
programVersion: 5.0.2
elementType: O O O O N N C C C C C C C C C C C C C C C C C H H H H H H H H H H H H H H H H H H H H H H
charge: 0
multiplicity: 1
keywords: wb97x-d3
keywords: def2-TZVPP
keywords: def2/J RIJCOSX
keywords: DEFGRID2
keywords: scfconv7
keywords: smallprint printgap noloewdin
keywords: NOSOSCF
formula: C17H22N2O4
InChI: InChI=1/C17H22N2O4/c1-6-7-18-9-13(20)19(16(18)22)10-23-15(21)14-12(8-11(2)3)17(14,4)5/h1,8,12,14H,7,9-10H2,2-5H3
45 atoms
O  0.189958 1.402509 0.491255
O  -0.505636 3.455336 1.006076
O  2.770642 0.050158 2.415588
O  2.114057 0.633913 -2.053075
N  2.340478 0.686334 0.249026
N  3.29888 -0.953894 -0.876457
C  -2.705325 1.391846 -0.770527
C  -2.442642 0.335262 0.266559
C  -2.130333 1.781028 0.580755
C  -4.120584 1.836138 -1.04582
C  -1.831024 1.421525 -2.000821
C  -3.52661 -0.34571 1.003014
C  -0.757436 2.308875 0.719226
C  -3.650574 -1.663301 1.196214
C  -4.801158 -2.217469 1.982684
C  -2.699846 -2.699766 0.678313
C  1.543898 1.841039 0.488439
C  2.848242 -0.130897 1.227659
C  2.543542 0.153071 -1.029814
C  3.509648 -1.279156 0.511651
C  3.557911 -1.888471 -1.943194
C  2.598064 -2.991783 -1.962964
C  1.818237 -3.905238 -1.95071
H  -1.575509 -0.278279 0.052873
H  -2.827888 2.301888 1.22894
H  -4.128099 2.831404 -1.494561
H  -4.604326 1.154829 -1.74874
H  -4.737297 1.878488 -0.14918
H  -1.725376 2.439758 -2.381233
H  -0.832428 1.021856 -1.834449
H  -2.287334 0.823652 -2.792281
H  -4.287232 0.298675 1.435641
H  -5.453907 -1.433969 2.368379
H  -5.408604 -2.889164 1.369538
H  -4.449056 -2.810058 2.831541
H  -3.238481 -3.459779 0.105705
H  -1.916142 -2.303406 0.03444
H  -2.213159 -3.226757 1.504488
H  1.711673 2.576275 -0.298052
H  1.821775 2.272601 1.449263
H  4.569587 -1.338859 0.769889
H  3.031857 -2.221589 0.796357
H  4.569863 -2.283542 -1.830589
H  3.536768 -1.355647 -2.894569
H  1.111728 -4.705411 -1.963067
elementType: O N C H
totalener: -1071.54722170 hartree
nucrepener: 1964.51950218 hartree
electener: -3036.06672389 hartree
oneelecener: -5361.00520099 hartree
twoeener: 2324.93847710 hartree
cpcmener: -0.04182443 hartree
kineticenergy: 1066.85813439 hartree
xcener: -102.620393423116 hartree
chargesum: -0.0000000
charge: -0.265523 -0.459509 -0.443183 -0.484195 -0.130160 -0.158480 0.087145 0.079050 -0.110083 -0.273287 -0.255290 -0.294438 0.402728 -0.046162 -0.221206 -0.251945 0.062541 0.294211 0.386576 0.002868 -0.051844 -0.422591 0.059530 0.094179 0.094029 0.098202 0.096232 0.087638 0.100002 0.073752 0.095710 0.118043 0.088280 0.092926 0.092496 0.093868 0.087228 0.097651 0.144679 0.132514 0.123876 0.125026 0.140077 0.134070 0.282770
qa: -0.2655 -0.4595 -0.4432 -0.4842 -0.1302 -0.1585 0.0871 0.0790 -0.1101 -0.2733 -0.2553 -0.2944 0.4027 -0.0462 -0.2212 -0.2519 0.0625 0.2942 0.3866 0.0029 -0.0518 -0.4226 0.0595 0.0942 0.0940 0.0982 0.0962 0.0876 0.1000 0.0738 0.0957 0.1180 0.0883 0.0929 0.0925 0.0939 0.0872 0.0977 0.1447 0.1325 0.1239 0.1250 0.1401 0.1341 0.2828
va: 2.1058 2.0435 2.0761 2.0348 3.1544 3.1965 3.7261 3.7165 3.8707 3.9096 3.9061 3.8689 4.1664 3.7632 3.9238 3.9444 3.8972 4.1970 4.3055 3.8927 3.9044 3.7463 3.5834 1.0234 1.0317 1.0017 1.0018 1.0060 1.0015 1.0225 1.0020 1.0102 1.0090 0.9962 0.9960 0.9979 1.0104 0.9961 0.9991 1.0064 1.0071 1.0065 0.9860 1.0031 0.9487
dispcorr: -0.021289073 hartree
energy: -1071.568510777181
dipole: -27.38441 28.14229 0.75788 -10.05710 7.58560 -2.47150 -2.74017 1.98074 -0.75943
magnitude: 2.69433 au
magnitude: 6.84845 debye
