program: Orca
programVersion: 5.0.2
elementType: O O O O N N C C C C C C C C C C C C C C C C C H H H H H H H H H H H H H H H H H H H H H H
charge: 0
multiplicity: 1
keywords: wb97x-d3
keywords: def2-TZVPP
keywords: def2/J RIJCOSX
keywords: DEFGRID2
keywords: scfconv7
keywords: smallprint printgap noloewdin
keywords: NOSOSCF
formula: C17H22N2O4
InChI: InChI=1/C17H22N2O4/c1-6-7-18-9-13(20)19(16(18)22)10-23-15(21)14-12(8-11(2)3)17(14,4)5/h1,8,12,14H,7,9-10H2,2-5H3
45 atoms
O  0.341409 1.739378 1.261818
O  0.153396 1.778755 -0.965719
O  3.282511 1.728248 -1.304998
O  1.747379 -0.813379 2.153689
N  2.377163 0.75236 0.574103
N  2.979257 -1.353528 0.281258
C  -2.91613 1.960487 -0.472482
C  -2.575373 0.506348 -0.491494
C  -1.786754 1.462724 0.408169
C  -4.142514 2.438753 0.270076
C  -2.63701 2.779539 -1.710458
C  -3.404195 -0.538225 0.137649
C  -0.362882 1.683086 0.120591
C  -3.340091 -1.853645 -0.097142
C  -4.234108 -2.805015 0.640368
C  -2.384021 -2.510843 -1.045499
C  1.747398 1.884845 1.184027
C  3.042078 0.763165 -0.626393
C  2.306961 -0.533833 1.118395
C  3.423035 -0.667394 -0.904392
C  2.935538 -2.790937 0.373031
C  1.932662 -3.371342 -0.519127
C  1.113811 -3.82768 -1.270338
H  -2.019044 0.198804 -1.370723
H  -2.023376 1.403506 1.4644
H  -4.067833 3.509875 0.467549
H  -5.042762 2.275607 -0.325951
H  -4.285096 1.945005 1.230758
H  -3.547642 2.845053 -2.309538
H  -2.343405 3.798829 -1.451855
H  -1.86235 2.355603 -2.344112
H  -4.119449 -0.200916 0.881749
H  -4.883813 -3.350951 -0.049164
H  -3.647425 -3.559474 1.17209
H  -4.867481 -2.298382 1.368797
H  -2.893639 -3.263394 -1.651788
H  -1.886066 -1.820743 -1.724192
H  -1.605922 -3.038984 -0.486969
H  2.033778 2.777682 0.628444
H  2.077195 1.990556 2.214694
H  2.909113 -1.017553 -1.805554
H  4.499376 -0.761646 -1.063403
H  2.731806 -3.074799 1.405874
H  3.920128 -3.194055 0.127498
H  0.392709 -4.252798 -1.932364
elementType: O N C H
totalener: -1071.54649740 hartree
nucrepener: 1999.97071334 hartree
electener: -3071.51721074 hartree
oneelecener: -5432.84934287 hartree
twoeener: 2361.33213214 hartree
cpcmener: -0.04307899 hartree
kineticenergy: 1066.86955320 hartree
xcener: -102.625161726273 hartree
chargesum: -0.0000000
charge: -0.283079 -0.463967 -0.441253 -0.483383 -0.125965 -0.161853 0.123965 -0.012646 -0.085163 -0.288742 -0.273746 -0.251268 0.404136 -0.034129 -0.218218 -0.272120 0.081865 0.293474 0.378727 -0.000777 -0.040875 -0.416478 0.034652 0.107590 0.089897 0.097848 0.101305 0.090333 0.093877 0.097742 0.092977 0.114152 0.093868 0.092214 0.087537 0.095108 0.094933 0.097905 0.133172 0.148508 0.123847 0.121815 0.131462 0.139657 0.291096
qa: -0.2831 -0.4640 -0.4413 -0.4834 -0.1260 -0.1619 0.1240 -0.0126 -0.0852 -0.2887 -0.2737 -0.2513 0.4041 -0.0341 -0.2182 -0.2721 0.0819 0.2935 0.3787 -0.0008 -0.0409 -0.4165 0.0347 0.1076 0.0899 0.0978 0.1013 0.0903 0.0939 0.0977 0.0930 0.1142 0.0939 0.0922 0.0875 0.0951 0.0949 0.0979 0.1332 0.1485 0.1238 0.1218 0.1315 0.1397 0.2911
va: 2.1143 2.0484 2.0780 2.0405 3.0944 3.1959 3.7123 3.8273 3.7890 3.9182 3.8904 3.8888 4.1637 3.7645 3.9223 3.9425 3.8879 4.2084 4.3345 3.8916 3.9010 3.7665 3.6113 1.0189 1.0349 1.0010 0.9999 1.0059 0.9997 1.0003 1.0208 1.0113 0.9963 0.9957 1.0091 0.9982 1.0069 0.9955 1.0175 0.9923 1.0055 1.0083 1.0057 0.9859 0.9430
dispcorr: -0.022111041 hartree
energy: -1071.568608440372
dipole: -28.34629 28.41459 0.06830 -5.64428 4.25271 -1.39157 -4.54129 4.59717 0.05588
magnitude: 1.39436 au
magnitude: 3.54419 debye
