program: Orca
programVersion: 5.0.2
elementType: O O O O N N C C C C C C C C C C C C C C C C C H H H H H H H H H H H H H H H H H H H H H H
charge: 0
multiplicity: 1
keywords: wb97x-d3
keywords: def2-TZVPP
keywords: def2/J RIJCOSX
keywords: DEFGRID2
keywords: scfconv7
keywords: smallprint printgap noloewdin
keywords: NOSOSCF
formula: C17H22N2O4
InChI: InChI=1/C17H22N2O4/c1-6-7-18-9-13(20)19(16(18)22)10-23-15(21)14-12(8-11(2)3)17(14,4)5/h1,8,12,14H,7,9-10H2,2-5H3
45 atoms
O  0.380493 1.562528 1.544167
O  0.026891 -0.62569 1.256451
O  2.111423 2.571075 -0.761248
O  3.101844 -1.228979 1.558193
N  2.453848 0.823548 0.686618
N  3.576897 -0.57871 -0.595072
C  -2.187145 0.88942 -0.566455
C  -2.765576 -0.073833 0.434105
C  -1.752559 0.936059 0.889919
C  -3.037171 2.039256 -1.044413
C  -1.23769 0.364661 -1.615346
C  -4.168795 0.029544 0.908093
C  -0.388221 0.505578 1.249986
C  -5.189106 -0.692768 0.436981
C  -6.572224 -0.54426 0.993706
C  -5.051599 -1.700133 -0.663059
C  1.751089 1.339017 1.824379
C  2.542441 1.471664 -0.515967
C  3.052492 -0.444016 0.640828
C  3.260703 0.533461 -1.450922
C  4.179993 -1.795302 -1.072749
C  3.243138 -2.632449 -1.820294
C  2.473823 -3.317454 -2.437717
H  -2.381735 -1.086169 0.343615
H  -2.115697 1.795362 1.445519
H  -3.686713 1.720334 -1.863012
H  -3.674843 2.443692 -0.258546
H  -2.412462 2.853862 -1.416632
H  -1.793778 0.081168 -2.51155
H  -0.515999 1.130852 -1.908697
H  -0.682277 -0.51475 -1.29107
H  -4.367919 0.744896 1.701241
H  -6.616917 0.192347 1.796161
H  -7.278687 -0.239249 0.216893
H  -6.941115 -1.494591 1.389219
H  -5.75606 -1.484512 -1.470894
H  -4.053316 -1.732766 -1.097102
H  -5.294552 -2.704486 -0.304924
H  2.145031 2.314683 2.099005
H  1.889192 0.652783 2.659321
H  2.600393 0.252042 -2.277357
H  4.153199 1.005453 -1.868377
H  4.57876 -2.351002 -0.223149
H  5.032809 -1.543088 -1.706254
H  1.791975 -3.929444 -2.98472
elementType: O N C H
totalener: -1071.54585833 hartree
nucrepener: 1979.91772915 hartree
electener: -3051.46358749 hartree
oneelecener: -5392.72218237 hartree
twoeener: 2341.25859488 hartree
cpcmener: -0.04453417 hartree
kineticenergy: 1066.86797374 hartree
xcener: -102.622894252076 hartree
chargesum: -0.0000000
charge: -0.272447 -0.443106 -0.447689 -0.479103 -0.117775 -0.147969 0.152108 -0.024147 -0.129960 -0.269894 -0.295197 -0.259748 0.393867 -0.034508 -0.228465 -0.248885 0.068431 0.270062 0.381162 0.005491 -0.060974 -0.419119 0.062482 0.100085 0.100634 0.095848 0.091393 0.099890 0.101944 0.096062 0.092059 0.119447 0.088573 0.093511 0.094189 0.094363 0.086808 0.100398 0.149046 0.137151 0.125138 0.124182 0.133067 0.138683 0.282911
qa: -0.2724 -0.4431 -0.4477 -0.4791 -0.1178 -0.1480 0.1521 -0.0241 -0.1300 -0.2699 -0.2952 -0.2597 0.3939 -0.0345 -0.2285 -0.2489 0.0684 0.2701 0.3812 0.0055 -0.0610 -0.4191 0.0625 0.1001 0.1006 0.0958 0.0914 0.0999 0.1019 0.0961 0.0921 0.1194 0.0886 0.0935 0.0942 0.0944 0.0868 0.1004 0.1490 0.1372 0.1251 0.1242 0.1331 0.1387 0.2829
va: 2.1161 2.0690 2.0626 2.0462 3.0930 3.1780 3.6854 3.8095 3.8512 3.8980 3.8997 3.8586 4.2314 3.7070 3.9280 3.9398 3.8912 4.2039 4.3247 3.9050 3.9016 3.7445 3.5809 1.0239 1.0323 1.0020 1.0024 1.0034 1.0025 1.0081 1.0125 1.0076 1.0078 0.9965 0.9950 0.9980 1.0082 0.9982 0.9916 1.0167 1.0013 1.0083 1.0040 0.9860 0.9486
dispcorr: -0.022938478 hartree
energy: -1071.568796811689
dipole: -32.84586 33.06773 0.22187 -1.79580 2.13822 0.34242 -9.11492 7.59230 -1.52262
magnitude: 1.57634 au
magnitude: 4.00674 debye
