program: Orca
programVersion: 5.0.2
elementType: O O O O N N C C C C C C C C C C C C C C C C C H H H H H H H H H H H H H H H H H H H H H H
charge: 0
multiplicity: 1
keywords: wb97x-d3
keywords: def2-TZVPP
keywords: def2/J RIJCOSX
keywords: DEFGRID2
keywords: scfconv7
keywords: smallprint printgap noloewdin
keywords: NOSOSCF
formula: C17H22N2O4
InChI: InChI=1/C17H22N2O4/c1-6-7-18-9-13(20)19(16(18)22)10-23-15(21)14-12(8-11(2)3)17(14,4)5/h1,8,12,14H,7,9-10H2,2-5H3
45 atoms
O  0.408514 1.766754 0.430811
O  -0.552094 2.190996 -1.553117
O  3.586293 1.108158 2.003932
O  1.516011 -0.31825 -1.792232
N  2.452779 0.741138 0.036842
N  3.086215 -1.3217 -0.438413
C  -3.215519 2.025396 0.090413
C  -2.960978 0.708581 -0.556415
C  -1.860387 1.354937 0.267786
C  -4.06503 2.0715 1.337603
C  -3.361818 3.256363 -0.769451
C  -3.606121 -0.542864 -0.080117
C  -0.640975 1.818509 -0.410185
C  -2.99093 -1.714011 0.102977
C  -3.73696 -2.917176 0.593704
C  -1.528743 -1.93322 -0.139853
C  1.718679 1.964874 -0.071014
C  3.284873 0.404081 1.073855
C  2.271692 -0.327188 -0.847163
C  3.736328 -1.008894 0.808096
C  3.023771 -2.657725 -0.974252
C  2.130295 -3.523863 -0.206943
C  1.402347 -4.224524 0.442172
H  -2.790069 0.764064 -1.629567
H  -1.689352 0.925116 1.248095
H  -3.922111 1.19911 1.975576
H  -3.827671 2.956799 1.930803
H  -5.124814 2.124531 1.07866
H  -2.983816 4.143273 -0.25667
H  -2.851191 3.176693 -1.72639
H  -4.419566 3.428037 -0.979904
H  -4.674188 -0.485762 0.11442
H  -3.289835 -3.304617 1.513504
H  -4.78621 -2.701454 0.795499
H  -3.692616 -3.730635 -0.135259
H  -1.056837 -1.130683 -0.702456
H  -0.989701 -2.040867 0.806096
H  -1.367395 -2.8616 -0.692704
H  1.712522 2.303571 -1.104644
H  2.206623 2.715949 0.545939
H  4.825065 -1.064326 0.737602
H  3.411213 -1.662138 1.623918
H  4.029356 -3.082505 -0.984838
H  2.696437 -2.607804 -2.013176
H  0.7531 -4.850823 1.012458
elementType: O N C H
totalener: -1071.54610591 hartree
nucrepener: 1999.64593222 hartree
electener: -3071.19203813 hartree
oneelecener: -5432.03986118 hartree
twoeener: 2360.84782305 hartree
cpcmener: -0.04157706 hartree
kineticenergy: 1066.87235904 hartree
xcener: -102.624261869623 hartree
chargesum: 0.0000000
charge: -0.283436 -0.453142 -0.447180 -0.481653 -0.115348 -0.150827 0.149290 0.000005 -0.120954 -0.282031 -0.284659 -0.299116 0.384798 -0.004278 -0.231034 -0.239736 0.069908 0.297754 0.379855 -0.001998 -0.041973 -0.403766 0.028659 0.104917 0.097489 0.092316 0.098005 0.097893 0.099307 0.093657 0.093551 0.120124 0.093028 0.089221 0.096726 0.076222 0.099103 0.101064 0.141837 0.129086 0.124196 0.125074 0.140768 0.134448 0.282825
qa: -0.2834 -0.4531 -0.4472 -0.4817 -0.1153 -0.1508 0.1493 0.0000 -0.1210 -0.2820 -0.2847 -0.2991 0.3848 -0.0043 -0.2310 -0.2397 0.0699 0.2978 0.3799 -0.0020 -0.0420 -0.4038 0.0287 0.1049 0.0975 0.0923 0.0980 0.0979 0.0993 0.0937 0.0936 0.1201 0.0930 0.0892 0.0967 0.0762 0.0991 0.1011 0.1418 0.1291 0.1242 0.1251 0.1408 0.1344 0.2828
va: 2.1005 2.0545 2.0738 2.0377 3.1178 3.1905 3.6917 3.7989 3.8092 3.9062 3.8959 3.8982 4.1629 3.7488 3.9312 3.9343 3.8805 4.2003 4.3123 3.8944 3.9052 3.7272 3.6131 1.0245 1.0292 1.0029 1.0029 1.0005 0.9986 1.0187 1.0009 1.0037 0.9961 1.0067 0.9963 1.0162 0.9956 0.9977 1.0175 1.0126 1.0069 1.0052 0.9863 1.0026 0.9502
dispcorr: -0.023516671 hartree
energy: -1071.569622577108
dipole: -26.26404 26.97494 0.71090 -5.29584 3.53228 -1.76356 3.53608 -2.54618 0.98990
magnitude: 2.14369 au
magnitude: 5.44883 debye
