program: Orca
programVersion: 5.0.2
elementType: O O O O N N C C C C C C C C C C C C C C C C C H H H H H H H H H H H H H H H H H H H H H H
charge: 0
multiplicity: 1
keywords: wb97x-d3
keywords: def2-TZVPP
keywords: def2/J RIJCOSX
keywords: DEFGRID2
keywords: scfconv7
keywords: smallprint printgap noloewdin
keywords: NOSOSCF
formula: C17H22N2O4
InChI: InChI=1/C17H22N2O4/c1-6-7-18-9-13(20)19(16(18)22)10-23-15(21)14-12(8-11(2)3)17(14,4)5/h1,8,12,14H,7,9-10H2,2-5H3
45 atoms
O  0.248593 1.156582 1.682824
O  -0.057151 -0.909158 0.876981
O  2.145042 2.717311 -0.079045
O  2.892322 -1.601584 1.166395
N  2.402996 0.648974 0.883891
N  3.584248 -0.400322 -0.669996
C  -1.972938 0.951904 -0.922988
C  -2.716691 -0.11207 -0.18456
C  -1.74516 0.763845 0.572098
C  -2.683435 2.224757 -1.311859
C  -0.898824 0.548899 -1.903918
C  -4.173585 -0.023396 0.090394
C  -0.466583 0.214521 1.046731
C  -4.820063 -0.746359 1.008736
C  -6.300746 -0.621438 1.197761
C  -4.141392 -1.72573 1.916069
C  1.585594 0.855796 2.045047
C  2.547336 1.579509 -0.113115
C  2.950479 -0.584019 0.514332
C  3.271517 0.89208 -1.234342
C  3.892929 -1.527042 -1.522494
C  2.708814 -2.033763 -2.213556
C  1.719142 -2.429593 -2.768609
H  -2.345965 -1.11813 -0.361448
H  -2.160656 1.548851 1.194627
H  -3.218528 2.094242 -2.254595
H  -3.402544 2.55164 -0.561394
H  -1.963902 3.033455 -1.450297
H  -1.328925 0.460091 -2.903147
H  -0.112357 1.305415 -1.952697
H  -0.434053 -0.407745 -1.668421
H  -4.749828 0.666751 -0.518812
H  -6.540043 -0.318184 2.220224
H  -6.742487 0.106435 0.517469
H  -6.799132 -1.580752 1.036523
H  -4.533715 -2.733902 1.759088
H  -3.06108 -1.761607 1.782882
H  -4.340642 -1.47958 2.962199
H  1.932221 1.723993 2.598975
H  1.65274 -0.02114 2.686794
H  2.607562 0.817515 -2.101789
H  4.164456 1.444794 -1.529541
H  4.351843 -2.315674 -0.926577
H  4.643589 -1.213376 -2.248268
H  0.847659 -2.79032 -3.266588
elementType: O N C H
totalener: -1071.53856207 hartree
nucrepener: 2017.24679087 hartree
electener: -3088.78535294 hartree
oneelecener: -5467.59261099 hartree
twoeener: 2378.80725804 hartree
cpcmener: -0.05420798 hartree
kineticenergy: 1066.86884722 hartree
xcener: -102.624460109330 hartree
chargesum: -0.0000000
charge: -0.280514 -0.477320 -0.471090 -0.500010 -0.113221 -0.160654 0.171572 -0.042458 -0.101529 -0.297454 -0.263578 -0.283200 0.408706 -0.018390 -0.230940 -0.245255 0.071794 0.296132 0.389814 -0.004458 -0.024154 -0.409689 0.015727 0.103221 0.100386 0.102655 0.091845 0.099378 0.105831 0.095837 0.072805 0.126623 0.095155 0.089710 0.095386 0.100300 0.077880 0.096500 0.151806 0.138646 0.129829 0.130455 0.136582 0.140830 0.288507
qa: -0.2805 -0.4773 -0.4711 -0.5000 -0.1132 -0.1607 0.1716 -0.0425 -0.1015 -0.2975 -0.2636 -0.2832 0.4087 -0.0184 -0.2309 -0.2453 0.0718 0.2961 0.3898 -0.0045 -0.0242 -0.4097 0.0157 0.1032 0.1004 0.1027 0.0918 0.0994 0.1058 0.0958 0.0728 0.1266 0.0952 0.0897 0.0954 0.1003 0.0779 0.0965 0.1518 0.1386 0.1298 0.1305 0.1366 0.1408 0.2885
va: 2.1120 2.0172 2.0304 2.0138 3.0966 3.1715 3.7328 3.8492 3.8194 3.9095 3.8864 3.8830 4.1467 3.7114 3.9287 3.9389 3.8941 4.1600 4.3141 3.9302 3.9046 3.7206 3.6340 1.0202 1.0297 0.9982 1.0010 1.0028 1.0033 1.0063 1.0104 1.0019 0.9961 1.0065 0.9955 0.9985 1.0197 0.9984 0.9923 1.0146 0.9976 1.0115 1.0007 0.9882 0.9460
dispcorr: -0.024189086 hartree
energy: -1071.562751157701
dipole: -29.51858 29.72821 0.20963 -0.22800 0.96547 0.73748 -5.32854 4.02429 -1.30425
magnitude: 1.51290 au
magnitude: 3.84549 debye
