program: Orca
programVersion: 5.0.2
elementType: O O O O N N C C C C C C C C C C C C C C C C C H H H H H H H H H H H H H H H H H H H H H H
charge: 0
multiplicity: 1
keywords: wb97x-d3
keywords: def2-TZVPP
keywords: def2/J RIJCOSX
keywords: DEFGRID2
keywords: scfconv7
keywords: smallprint printgap noloewdin
keywords: NOSOSCF
formula: C17H22N2O4
InChI: InChI=1/C17H22N2O4/c1-6-7-18-9-13(20)19(16(18)22)10-23-15(21)14-12(8-11(2)3)17(14,4)5/h1,8,12,14H,7,9-10H2,2-5H3
45 atoms
O  -0.06279 -1.025037 0.586503
O  -1.470629 -1.383247 -1.126689
O  1.218256 -0.000573 -2.254211
O  3.408814 -1.352715 1.502908
N  2.067249 -0.937091 -0.337003
N  3.867969 0.314398 -0.019362
C  -2.422891 1.488246 -0.198172
C  -3.447546 0.449386 0.144075
C  -2.005922 0.231903 0.55515
C  -2.36142 2.775721 0.586939
C  -2.043381 1.672833 -1.646789
C  -4.465095 0.650487 1.193781
C  -1.195566 -0.801335 -0.1058
C  -5.751146 0.28831 1.138778
C  -6.669217 0.555888 2.293507
C  -6.403379 -0.398861 -0.021481
C  0.972677 -1.79677 0.001171
C  2.076718 -0.083047 -1.408909
C  3.1665 -0.718412 0.500402
C  3.3506 0.706544 -1.309083
C  5.247248 0.552197 0.341932
C  6.171373 -0.299701 -0.403529
C  6.913402 -1.00218 -1.03507
H  -3.758616 -0.152635 -0.702674
H  -1.766792 0.393522 1.600408
H  -1.37924 3.238763 0.476553
H  -3.103196 3.484365 0.21335
H  -2.539205 2.637147 1.652237
H  -2.665193 2.455742 -2.084946
H  -1.003385 1.990666 -1.74235
H  -2.181983 0.777261 -2.248075
H  -4.120973 1.138151 2.101204
H  -7.506182 1.189809 1.989344
H  -7.107765 -0.372633 2.668157
H  -6.158798 1.046015 3.122288
H  -5.743129 -0.558399 -0.871226
H  -6.795653 -1.372681 0.282249
H  -7.26105 0.180006 -0.373054
H  1.309894 -2.51856 0.739794
H  0.6365 -2.329117 -0.885094
H  4.021306 0.432627 -2.129467
H  3.153928 1.777871 -1.368011
H  5.368231 0.396049 1.413641
H  5.478392 1.601425 0.155087
H  7.574415 -1.627847 -1.592457
elementType: O N C H
totalener: -1071.54075604 hartree
nucrepener: 1918.43048808 hartree
electener: -2989.97124412 hartree
oneelecener: -5269.53309035 hartree
twoeener: 2279.56184622 hartree
cpcmener: -0.05221259 hartree
kineticenergy: 1066.86622758 hartree
xcener: -102.624900799544 hartree
chargesum: -0.0000000
charge: -0.283865 -0.473371 -0.475552 -0.507950 -0.109369 -0.173519 0.111111 0.036982 -0.087740 -0.273190 -0.282950 -0.285998 0.401745 -0.050160 -0.217391 -0.253425 0.072104 0.323511 0.403598 0.004992 -0.033263 -0.433989 0.050681 0.094019 0.094046 0.097627 0.098372 0.091084 0.101717 0.092204 0.094381 0.122028 0.093693 0.092922 0.088444 0.090576 0.096992 0.096002 0.132637 0.143542 0.128319 0.124248 0.135267 0.141281 0.287605
qa: -0.2839 -0.4734 -0.4756 -0.5080 -0.1094 -0.1735 0.1111 0.0370 -0.0877 -0.2732 -0.2829 -0.2860 0.4017 -0.0502 -0.2174 -0.2534 0.0721 0.3235 0.4036 0.0050 -0.0333 -0.4340 0.0507 0.0940 0.0940 0.0976 0.0984 0.0911 0.1017 0.0922 0.0944 0.1220 0.0937 0.0929 0.0884 0.0906 0.0970 0.0960 0.1326 0.1435 0.1283 0.1242 0.1353 0.1413 0.2876
va: 2.1103 2.0302 2.0327 2.0111 3.1308 3.1928 3.6845 3.7865 3.8113 3.9090 3.8932 3.8751 4.1687 3.7631 3.9195 3.9402 3.8743 4.1515 4.2968 3.9060 3.9071 3.7367 3.5891 1.0293 1.0342 1.0014 1.0014 1.0061 1.0022 1.0084 1.0168 1.0103 0.9962 0.9962 1.0088 1.0104 0.9964 0.9972 1.0157 1.0150 1.0026 1.0103 1.0017 0.9874 0.9452
dispcorr: -0.020830120 hartree
energy: -1071.561586164057
dipole: -32.64101 33.73769 1.09668 13.13449 -11.36314 1.77136 3.26698 -2.99044 0.27653
magnitude: 2.10164 au
magnitude: 5.34194 debye
