program: Orca
programVersion: 5.0.2
elementType: O O O O N N C C C C C C C C C C C C C C C C C H H H H H H H H H H H H H H H H H H H H H H
charge: 0
multiplicity: 1
keywords: wb97x-d3
keywords: def2-TZVPP
keywords: def2/J RIJCOSX
keywords: DEFGRID2
keywords: scfconv7
keywords: smallprint printgap noloewdin
keywords: NOSOSCF
formula: C17H22N2O4
InChI: InChI=1/C17H22N2O4/c1-6-7-18-9-13(20)19(16(18)22)10-23-15(21)14-12(8-11(2)3)17(14,4)5/h1,8,12,14H,7,9-10H2,2-5H3
45 atoms
O  0.363975 1.441658 0.261986
O  -0.604821 0.734579 2.160303
O  3.505624 2.613928 -1.118283
O  2.107925 -1.022184 1.231463
N  2.641932 1.026733 0.305073
N  3.886883 -0.7314 -0.206163
C  -2.206709 -1.007057 0.072685
C  -3.077472 0.092252 0.600912
C  -1.705792 0.430858 0.056552
C  -2.503416 -1.611815 -1.277812
C  -1.635422 -2.004582 1.05033
C  -4.270234 0.575538 -0.125714
C  -0.629175 0.863819 0.960194
C  -5.512004 0.665197 0.36169
C  -6.635235 1.175569 -0.490553
C  -5.915213 0.273562 1.749474
C  1.580609 1.769568 0.912838
C  3.472371 1.488396 -0.684478
C  2.811146 -0.343206 0.515096
C  4.315134 0.316353 -1.104524
C  4.118911 -2.125996 -0.510945
C  3.233993 -2.618052 -1.564017
C  2.49552 -2.998378 -2.431894
H  -3.143356 0.115675 1.683565
H  -1.676625 0.886013 -0.927414
H  -3.283267 -2.37098 -1.19147
H  -2.835051 -0.875636 -2.008687
H  -1.612719 -2.097746 -1.680505
H  -0.644767 -2.340891 0.737163
H  -1.5578 -1.617497 2.06376
H  -2.282281 -2.882783 1.088996
H  -4.109813 0.880119 -1.156029
H  -7.425963 0.426865 -0.585685
H  -7.099625 2.056385 -0.039584
H  -6.303823 1.445213 -1.493029
H  -6.662162 -0.523801 1.715294
H  -5.090931 -0.07662 2.367346
H  -6.387516 1.112663 2.265961
H  1.772599 2.830117 0.770219
H  1.54366 1.557151 1.978292
H  4.110792 0.074325 -2.151768
H  5.377979 0.541497 -1.004126
H  3.992472 -2.717349 0.395738
H  5.160726 -2.2422 -0.810731
H  1.839774 -3.336781 -3.202798
elementType: O N C H
totalener: -1071.54099099 hartree
nucrepener: 1945.11557041 hartree
electener: -3016.65656141 hartree
oneelecener: -5323.20571381 hartree
twoeener: 2306.54915240 hartree
cpcmener: -0.05228380 hartree
kineticenergy: 1066.86222530 hartree
xcener: -102.623709066993 hartree
chargesum: 0.0000000
charge: -0.282523 -0.477056 -0.473939 -0.509761 -0.110773 -0.170776 0.121481 0.037206 -0.107111 -0.266185 -0.281826 -0.287301 0.403915 -0.045387 -0.219231 -0.251853 0.072212 0.321807 0.410728 0.001626 -0.031303 -0.436572 0.048403 0.094460 0.093212 0.097897 0.089232 0.097746 0.090472 0.094747 0.099878 0.122660 0.093386 0.093991 0.088983 0.097194 0.090144 0.095693 0.129337 0.145230 0.127723 0.125933 0.136410 0.141847 0.288045
qa: -0.2825 -0.4771 -0.4739 -0.5098 -0.1108 -0.1708 0.1215 0.0372 -0.1071 -0.2662 -0.2818 -0.2873 0.4039 -0.0454 -0.2192 -0.2519 0.0722 0.3218 0.4107 0.0016 -0.0313 -0.4366 0.0484 0.0945 0.0932 0.0979 0.0892 0.0977 0.0905 0.0947 0.0999 0.1227 0.0934 0.0940 0.0890 0.0972 0.0901 0.0957 0.1293 0.1452 0.1277 0.1259 0.1364 0.1418 0.2880
va: 2.1103 2.0268 2.0391 2.0017 3.1268 3.1891 3.6754 3.7773 3.8501 3.9088 3.8963 3.8667 4.1583 3.7514 3.9203 3.9426 3.8713 4.1671 4.2839 3.9079 3.9132 3.7363 3.5914 1.0298 1.0365 1.0023 1.0050 1.0027 1.0098 1.0160 1.0021 1.0089 0.9964 0.9961 1.0084 0.9971 1.0094 0.9971 1.0139 1.0161 1.0048 1.0080 0.9988 0.9878 0.9453
dispcorr: -0.021190825 hartree
energy: -1071.562181818627
dipole: -33.69095 34.59996 0.90901 -8.17115 7.22370 -0.94745 -2.23285 0.59055 -1.64230
magnitude: 2.10264 au
magnitude: 5.34449 debye
