program: Orca
programVersion: 5.0.2
elementType: O O O O N N C C C C C C C C C C C C C C C C C H H H H H H H H H H H H H H H H H H H H H H
charge: 0
multiplicity: 1
keywords: wb97x-d3
keywords: def2-TZVPP
keywords: def2/J RIJCOSX
keywords: DEFGRID2
keywords: scfconv7
keywords: smallprint printgap noloewdin
keywords: NOSOSCF
formula: C17H22N2O4
InChI: InChI=1/C17H22N2O4/c1-6-7-18-9-13(20)19(16(18)22)10-23-15(21)14-12(8-11(2)3)17(14,4)5/h1,8,12,14H,7,9-10H2,2-5H3
45 atoms
O  0.364616 1.344337 0.310991
O  -0.644221 0.760023 2.229412
O  3.644829 2.571559 -0.916162
O  1.983594 -1.204994 1.013334
N  2.62941 0.887659 0.278702
N  3.773397 -0.873876 -0.405787
C  -2.312741 -0.97966 0.183882
C  -3.139241 0.164506 0.689033
C  -1.756135 0.436745 0.133839
C  -2.625716 -1.604155 -1.153833
C  -1.786096 -1.977589 1.185575
C  -4.322679 0.666612 -0.037563
C  -0.659743 0.846909 1.025032
C  -5.524476 0.932333 0.486047
C  -6.64827 1.415489 -0.381722
C  -5.885909 0.77533 1.931513
C  1.599529 1.614949 0.954258
C  3.529875 1.408478 -0.613457
C  2.724267 -0.505444 0.35505
C  4.33649 0.244857 -1.121166
C  4.057998 -2.243434 -0.760434
C  3.606669 -2.565711 -2.111996
C  3.260549 -2.798334 -3.238551
H  -3.196479 0.213409 1.771132
H  -1.70951 0.865347 -0.861219
H  -3.434993 -2.330502 -1.057264
H  -2.920395 -0.873863 -1.905869
H  -1.751275 -2.133759 -1.536118
H  -0.822826 -2.382849 0.869657
H  -1.66958 -1.564606 2.185016
H  -2.483896 -2.813538 1.261373
H  -4.195652 0.821267 -1.105153
H  -6.351989 1.515186 -1.425636
H  -7.497915 0.729181 -0.336328
H  -7.019203 2.385517 -0.040744
H  -6.280776 1.712431 2.331467
H  -6.681696 0.034801 2.045922
H  -5.056922 0.467391 2.565172
H  1.814371 2.67791 0.872406
H  1.578052 1.338776 2.005685
H  4.214843 0.151511 -2.204092
H  5.397702 0.383521 -0.904466
H  3.578965 -2.90101 -0.035412
H  5.13174 -2.421714 -0.679546
H  2.952289 -3.029417 -4.234012
elementType: O N C H
totalener: -1071.54039370 hartree
nucrepener: 1928.83610414 hartree
electener: -3000.37649784 hartree
oneelecener: -5290.51512146 hartree
twoeener: 2290.13862362 hartree
cpcmener: -0.05014392 hartree
kineticenergy: 1066.84866637 hartree
xcener: -102.624049006880 hartree
chargesum: -0.0000000
charge: -0.283746 -0.477235 -0.476786 -0.518991 -0.112351 -0.151802 0.111724 0.034560 -0.092475 -0.270097 -0.279512 -0.283506 0.399434 -0.051386 -0.217217 -0.250489 0.070865 0.321772 0.409610 0.000983 -0.034278 -0.430316 0.050885 0.094815 0.093667 0.098222 0.089665 0.098242 0.091965 0.094026 0.100832 0.122198 0.088925 0.093622 0.093439 0.095239 0.097308 0.089899 0.128984 0.145167 0.125965 0.127107 0.131731 0.142091 0.287243
qa: -0.2837 -0.4772 -0.4768 -0.5190 -0.1124 -0.1518 0.1117 0.0346 -0.0925 -0.2701 -0.2795 -0.2835 0.3994 -0.0514 -0.2172 -0.2505 0.0709 0.3218 0.4096 0.0010 -0.0343 -0.4303 0.0509 0.0948 0.0937 0.0982 0.0897 0.0982 0.0920 0.0940 0.1008 0.1222 0.0889 0.0936 0.0934 0.0952 0.0973 0.0899 0.1290 0.1452 0.1260 0.1271 0.1317 0.1421 0.2872
va: 2.1060 2.0265 2.0376 1.9923 3.1245 3.2093 3.6824 3.7869 3.8275 3.9096 3.8954 3.8704 4.1629 3.7628 3.9192 3.9401 3.8674 4.1717 4.2763 3.9015 3.8955 3.7487 3.5818 1.0296 1.0349 1.0019 1.0058 1.0020 1.0102 1.0163 1.0014 1.0098 1.0087 0.9959 0.9965 0.9969 0.9968 1.0103 1.0147 1.0155 1.0073 1.0065 1.0074 0.9862 0.9459
dispcorr: -0.020671631 hartree
energy: -1071.561065331353
dipole: -34.03286 34.96954 0.93668 -6.56035 5.55753 -1.00282 -1.02232 -0.59877 -1.62110
magnitude: 2.12391 au
magnitude: 5.39854 debye
