program: Orca
programVersion: 5.0.2
elementType: O O O O N N C C C C C C C C C C C C C C C C C H H H H H H H H H H H H H H H H H H H H H H
charge: 0
multiplicity: 1
keywords: wb97x-d3
keywords: def2-TZVPP
keywords: def2/J RIJCOSX
keywords: DEFGRID2
keywords: scfconv7
keywords: smallprint printgap noloewdin
keywords: NOSOSCF
formula: C17H22N2O4
InChI: InChI=1/C17H22N2O4/c1-6-7-18-9-13(20)19(16(18)22)10-23-15(21)14-12(8-11(2)3)17(14,4)5/h1,8,12,14H,7,9-10H2,2-5H3
45 atoms
O  0.44144 1.028908 0.747655
O  -0.610269 2.262993 -0.80712
O  1.671004 0.361502 -2.200052
O  3.716784 0.035572 1.851378
N  2.557901 0.533451 -0.092048
N  4.141189 -1.006838 -0.158488
C  -3.054589 1.430074 1.039577
C  -3.114303 0.741423 -0.290029
C  -1.835262 0.686543 0.51021
C  -3.739418 0.797488 2.225024
C  -3.076474 2.937762 1.074366
C  -3.885912 -0.506987 -0.498539
C  -0.643059 1.416219 0.052372
C  -5.023229 -0.607016 -1.193161
C  -5.720528 -1.92372 -1.351708
C  -5.704347 0.548623 -1.859415
C  1.711978 1.56679 0.420432
C  2.451534 0.004088 -1.350906
C  3.510002 -0.14974 0.672286
C  3.475739 -1.092589 -1.437178
C  4.994037 -2.063579 0.332409
C  4.246076 -3.22994 0.7966
C  3.637657 -4.19313 1.176894
H  -3.082612 1.420052 -1.13694
H  -1.621086 -0.247167 1.0194
H  -3.666172 -0.289599 2.222971
H  -3.301723 1.158043 3.157515
H  -4.799554 1.059201 2.234572
H  -2.506357 3.320195 1.923529
H  -2.683655 3.395628 0.1690
H  -4.105856 3.282858 1.189694
H  -3.486656 -1.406639 -0.038913
H  -5.821351 -2.188083 -2.407572
H  -5.191344 -2.733836 -0.850381
H  -6.735128 -1.880368 -0.947585
H  -5.186631 1.496577 -1.725973
H  -5.809863 0.370763 -2.932609
H  -6.717805 0.668738 -1.468308
H  1.637139 2.371264 -0.30763
H  2.153062 1.959537 1.332785
H  2.977353 -2.055607 -1.582748
H  4.157896 -0.927037 -2.27245
H  5.618032 -1.675717 1.137752
H  5.67427 -2.355084 -0.468897
H  3.097915 -5.047665 1.518634
elementType: O N C H
totalener: -1071.54018943 hartree
nucrepener: 1907.26104233 hartree
electener: -2978.80123175 hartree
oneelecener: -5247.36288108 hartree
twoeener: 2268.56164933 hartree
cpcmener: -0.05366914 hartree
kineticenergy: 1066.86378406 hartree
xcener: -102.624017325043 hartree
chargesum: -0.0000000
charge: -0.281114 -0.479990 -0.475932 -0.511299 -0.109608 -0.174474 0.146279 0.007296 -0.151843 -0.263801 -0.290405 -0.276971 0.441028 -0.032542 -0.228038 -0.251694 0.062640 0.319692 0.408451 0.010302 -0.049711 -0.435838 0.062078 0.095902 0.096209 0.091071 0.099161 0.096855 0.102413 0.092284 0.097657 0.123808 0.095101 0.089539 0.094113 0.088623 0.097515 0.096573 0.143706 0.132739 0.128080 0.125749 0.137753 0.141943 0.288700
qa: -0.2811 -0.4800 -0.4759 -0.5113 -0.1096 -0.1745 0.1463 0.0073 -0.1518 -0.2638 -0.2904 -0.2770 0.4410 -0.0325 -0.2280 -0.2517 0.0626 0.3197 0.4085 0.0103 -0.0497 -0.4358 0.0621 0.0959 0.0962 0.0911 0.0992 0.0969 0.1024 0.0923 0.0977 0.1238 0.0951 0.0895 0.0941 0.0886 0.0975 0.0966 0.1437 0.1327 0.1281 0.1257 0.1378 0.1419 0.2887
va: 2.1119 2.0275 2.0357 2.0065 3.1289 3.1962 3.6778 3.7688 3.8831 3.9052 3.9068 3.8724 4.1518 3.7100 3.9251 3.9441 3.8769 4.1689 4.2906 3.9018 3.9044 3.7417 3.5804 1.0276 1.0378 1.0026 1.0027 1.0028 0.9992 1.0161 1.0008 1.0070 0.9953 1.0080 0.9963 1.0084 0.9976 0.9975 1.0159 1.0140 1.0050 1.0078 0.9985 0.9868 0.9444
dispcorr: -0.020324124 hartree
energy: -1071.560513549417
dipole: -36.60602 37.12825 0.52223 -0.77900 -0.81852 -1.59753 0.19188 -0.16675 0.02513
magnitude: 1.68091 au
magnitude: 4.27252 debye
