program: Orca
programVersion: 5.0.2
elementType: O O O O N N C C C C C C C C C C C C C C C C C H H H H H H H H H H H H H H H H H H H H H H
charge: 0
multiplicity: 1
keywords: wb97x-d3
keywords: def2-TZVPP
keywords: def2/J RIJCOSX
keywords: DEFGRID2
keywords: scfconv7
keywords: smallprint printgap noloewdin
keywords: NOSOSCF
formula: C17H22N2O4
InChI: InChI=1/C17H22N2O4/c1-6-7-18-9-13(20)19(16(18)22)10-23-15(21)14-12(8-11(2)3)17(14,4)5/h1,8,12,14H,7,9-10H2,2-5H3
45 atoms
O  0.403667 1.452472 1.401088
O  -0.180435 -0.697096 1.195731
O  2.02284 2.391131 -1.016405
O  2.771861 -1.603994 1.04549
N  2.294478 0.549026 0.326905
N  2.795283 -0.999974 -1.174901
C  -2.330492 0.982099 -0.543032
C  -2.95825 0.120837 0.519518
C  -1.814411 1.029081 0.886107
C  -3.052513 2.211735 -1.03417
C  -1.507293 0.311492 -1.61585
C  -4.304309 0.400272 1.0612
C  -0.484599 0.471309 1.183106
C  -5.325566 -0.459888 1.132213
C  -6.648125 -0.033305 1.694832
C  -5.280686 -1.880334 0.658795
C  1.768905 1.095812 1.544182
C  2.312863 1.228837 -0.863345
C  2.637248 -0.797252 0.153199
C  2.761724 0.244944 -1.906144
C  3.50537 -2.15227 -1.681079
C  4.956636 -2.006026 -1.595115
C  6.149181 -1.875182 -1.533714
H  -2.692463 -0.928148 0.442379
H  -2.051831 1.94107 1.424605
H  -2.346361 2.915206 -1.478924
H  -3.779126 1.943346 -1.803542
H  -3.584223 2.736864 -0.242059
H  -0.715044 0.974547 -1.972277
H  -1.045916 -0.61831 -1.286798
H  -2.141028 0.071453 -2.471468
H  -4.469673 1.409184 1.428408
H  -6.923783 -0.644178 2.558168
H  -6.645843 1.010849 2.007193
H  -7.445922 -0.163244 0.958805
H  -5.928827 -2.011617 -0.211671
H  -4.285818 -2.221345 0.38012
H  -5.661434 -2.555407 1.428338
H  2.281556 2.021208 1.791967
H  1.924485 0.380514 2.35021
H  2.063616 0.21571 -2.743923
H  3.747077 0.531084 -2.286717
H  3.211093 -2.306791 -2.719533
H  3.18301 -3.038952 -1.135442
H  7.209393 -1.76632 -1.476989
elementType: O N C H
totalener: -1071.54033420 hartree
nucrepener: 1970.23185803 hartree
electener: -3041.77219223 hartree
oneelecener: -5373.18800564 hartree
twoeener: 2331.41581341 hartree
cpcmener: -0.05411146 hartree
kineticenergy: 1066.86747054 hartree
xcener: -102.624778980246 hartree
chargesum: -0.0000000
charge: -0.275038 -0.470270 -0.472138 -0.502649 -0.116789 -0.161980 0.121221 0.021153 -0.108318 -0.269407 -0.276206 -0.284936 0.403901 -0.051530 -0.218239 -0.251255 0.070827 0.301086 0.391594 -0.001563 -0.037658 -0.441394 0.057701 0.095285 0.100366 0.098286 0.098141 0.089557 0.093456 0.089880 0.105339 0.122883 0.094322 0.088105 0.093121 0.099698 0.090200 0.093548 0.152210 0.139319 0.125476 0.136523 0.141620 0.136433 0.288121
qa: -0.2750 -0.4703 -0.4721 -0.5026 -0.1168 -0.1620 0.1212 0.0212 -0.1083 -0.2694 -0.2762 -0.2849 0.4039 -0.0515 -0.2182 -0.2513 0.0708 0.3011 0.3916 -0.0016 -0.0377 -0.4414 0.0577 0.0953 0.1004 0.0983 0.0981 0.0896 0.0935 0.0899 0.1053 0.1229 0.0943 0.0881 0.0931 0.0997 0.0902 0.0935 0.1522 0.1393 0.1255 0.1365 0.1416 0.1364 0.2881
va: 2.1154 2.0348 2.0310 2.0133 3.1075 3.1678 3.6899 3.8038 3.8237 3.8991 3.9011 3.8597 4.2017 3.7624 3.9206 3.9392 3.8893 4.1651 4.3036 3.9123 3.9043 3.7404 3.5838 1.0285 1.0322 1.0026 1.0015 1.0051 1.0069 1.0156 1.0015 1.0086 0.9964 1.0088 0.9958 0.9963 1.0101 0.9977 0.9928 1.0155 1.0071 1.0040 0.9873 1.0001 0.9448
dispcorr: -0.022550001 hartree
energy: -1071.562884206237
dipole: -33.74436 33.55903 -0.18533 -0.39868 0.71833 0.31965 -4.82549 3.07246 -1.75303
magnitude: 1.79155 au
magnitude: 4.55375 debye
