program: Orca
programVersion: 5.0.2
elementType: O O O O N N C C C C C C C C C C C C C C C C C H H H H H H H H H H H H H H H H H H H H H H
charge: 0
multiplicity: 1
keywords: wb97x-d3
keywords: def2-TZVPP
keywords: def2/J RIJCOSX
keywords: DEFGRID2
keywords: scfconv7
keywords: smallprint printgap noloewdin
keywords: NOSOSCF
formula: C17H22N2O4
InChI: InChI=1/C17H22N2O4/c1-6-7-18-9-13(20)19(16(18)22)10-23-15(21)14-12(8-11(2)3)17(14,4)5/h1,8,12,14H,7,9-10H2,2-5H3
45 atoms
O  0.14516 0.669281 0.05656
O  -0.917835 2.622543 0.227748
O  2.269918 0.065881 -2.586536
O  2.903922 0.123296 1.924806
N  2.393046 0.400938 -0.316034
N  3.99996 -1.006276 0.239564
C  -3.095002 0.7808 1.606882
C  -3.521712 1.166487 0.234466
C  -2.141306 0.570995 0.435282
C  -3.640566 -0.486627 2.217782
C  -2.829393 1.861874 2.624881
C  -4.554742 0.410995 -0.520909
C  -0.952399 1.411833 0.239864
C  -4.547221 0.219369 -1.842717
C  -5.647061 -0.531406 -2.528669
C  -3.460595 0.721588 -2.742714
C  1.364807 1.372294 -0.157749
C  2.746529 -0.181745 -1.505561
C  3.095045 -0.155742 0.760974
C  3.831663 -1.170831 -1.182763
C  4.804758 -1.900005 1.035182
C  4.243905 -3.246209 1.120911
C  3.789687 -4.357335 1.175426
H  -3.506768 2.237776 0.046813
H  -2.013685 -0.462554 0.134298
H  -3.788618 -1.27738 1.48252
H  -2.958553 -0.867129 2.980113
H  -4.600674 -0.295279 2.70105
H  -2.539247 2.810186 2.178083
H  -3.735579 2.042256 3.20606
H  -2.046916 1.560654 3.323667
H  -5.387048 0.014795 0.054493
H  -6.39606 -0.896395 -1.826209
H  -6.151452 0.099793 -3.264531
H  -5.251244 -1.389115 -3.078426
H  -2.935258 -0.113225 -3.214093
H  -3.881418 1.317409 -3.556243
H  -2.722337 1.334436 -2.22881
H  1.309969 1.982003 -1.058815
H  1.602225 2.011489 0.691207
H  3.509195 -2.181157 -1.450197
H  4.743759 -0.942227 -1.737856
H  4.917683 -1.478037 2.033705
H  5.80697 -1.950342 0.605981
H  3.389753 -5.345919 1.219511
elementType: O N C H
totalener: -1071.54062844 hartree
nucrepener: 1911.83085143 hartree
electener: -2983.37147986 hartree
oneelecener: -5256.10606081 hartree
twoeener: 2272.73458094 hartree
cpcmener: -0.04877231 hartree
kineticenergy: 1066.85619483 hartree
xcener: -102.623084907220 hartree
chargesum: 0.0000000
charge: -0.279176 -0.499661 -0.474525 -0.515283 -0.130629 -0.157877 0.150057 -0.011604 -0.097708 -0.286661 -0.278754 -0.299369 0.411432 -0.013823 -0.229368 -0.243414 0.080345 0.319700 0.406154 0.004614 -0.047232 -0.430304 0.058932 0.102892 0.096198 0.093937 0.098977 0.100198 0.091336 0.096888 0.102058 0.125092 0.090026 0.097071 0.094892 0.100779 0.101459 0.082059 0.135317 0.135955 0.127800 0.127217 0.132711 0.143298 0.287997
qa: -0.2792 -0.4997 -0.4745 -0.5153 -0.1306 -0.1579 0.1501 -0.0116 -0.0977 -0.2867 -0.2788 -0.2994 0.4114 -0.0138 -0.2294 -0.2434 0.0803 0.3197 0.4062 0.0046 -0.0472 -0.4303 0.0589 0.1029 0.0962 0.0939 0.0990 0.1002 0.0913 0.0969 0.1021 0.1251 0.0900 0.0971 0.0949 0.1008 0.1015 0.0821 0.1353 0.1360 0.1278 0.1272 0.1327 0.1433 0.2880
va: 2.1081 1.9966 2.0376 2.0012 3.1586 3.2053 3.7011 3.8097 3.8382 3.9107 3.8923 3.8927 4.0882 3.7050 3.9299 3.9364 3.8895 4.1699 4.2861 3.8991 3.8930 3.7420 3.5758 1.0261 1.0284 1.0016 1.0027 0.9994 1.0168 1.0010 0.9988 1.0028 1.0061 0.9960 0.9966 0.9982 0.9996 1.0137 1.0021 1.0032 1.0062 1.0072 1.0051 0.9855 0.9450
dispcorr: -0.020420985 hartree
energy: -1071.561049422116
dipole: -30.56850 31.64983 1.08133 -1.83800 -0.14648 -1.98447 -0.96301 0.59049 -0.37252
magnitude: 2.29046 au
magnitude: 5.82187 debye
