program: Orca
programVersion: 5.0.2
elementType: O O O O N N C C C C C C C C C C C C C C C C C H H H H H H H H H H H H H H H H H H H H H H
charge: 0
multiplicity: 1
keywords: wb97x-d3
keywords: def2-TZVPP
keywords: def2/J RIJCOSX
keywords: DEFGRID2
keywords: scfconv7
keywords: smallprint printgap noloewdin
keywords: NOSOSCF
formula: C17H22N2O4
InChI: InChI=1/C17H22N2O4/c1-6-7-18-9-13(20)19(16(18)22)10-23-15(21)14-12(8-11(2)3)17(14,4)5/h1,8,12,14H,7,9-10H2,2-5H3
45 atoms
O  0.089235 1.240233 0.901906
O  -0.324827 2.955667 -0.483145
O  2.59116 -0.84746 2.281724
O  1.865453 0.898875 -1.862082
N  2.166427 0.350907 0.364277
N  2.685709 -1.145587 -1.181722
C  -2.416626 0.106779 -0.580241
C  -2.660452 0.367934 0.876447
C  -2.084468 1.467416 0.019543
C  -3.591099 0.084469 -1.525495
C  -1.321968 -0.856252 -0.968949
C  -4.030471 0.525512 1.424956
C  -0.703331 1.970955 0.107079
C  -4.696469 -0.419282 2.094472
C  -6.076121 -0.173554 2.624622
C  -4.148877 -1.786093 2.368969
C  1.487801 1.480237 0.919657
C  2.603618 -0.735841 1.080332
C  2.211289 0.106306 -1.012694
C  3.112019 -1.726062 0.069098
C  3.150031 -1.634307 -2.457899
C  4.536892 -1.26728 -2.736134
C  5.679816 -0.969087 -2.954124
H  -1.953619 -0.124386 1.536279
H  -2.773689 2.25291 -0.272277
H  -4.070763 -0.896322 -1.51293
H  -4.347319 0.826143 -1.271176
H  -3.263869 0.279377 -2.548308
H  -1.754865 -1.844067 -1.137444
H  -0.833996 -0.55269 -1.897139
H  -0.559967 -0.969097 -0.200654
H  -4.519572 1.48095 1.257318
H  -6.788142 -0.890071 2.207286
H  -6.10787 -0.30512 3.709326
H  -6.433228 0.830315 2.395844
H  -4.811342 -2.550454 1.95486
H  -3.156804 -1.94869 1.951152
H  -4.097379 -1.976059 3.444193
H  1.755245 2.37844 0.368898
H  1.793433 1.598631 1.955752
H  4.201214 -1.806141 0.142975
H  2.680389 -2.714074 0.235252
H  2.496958 -1.253949 -3.24353
H  3.045966 -2.720077 -2.470615
H  6.697551 -0.713347 -3.148911
elementType: O N C H
totalener: -1071.53855647 hartree
nucrepener: 1972.54349137 hartree
electener: -3044.08204784 hartree
oneelecener: -5377.19103499 hartree
twoeener: 2333.10898715 hartree
cpcmener: -0.05516873 hartree
kineticenergy: 1066.85921239 hartree
xcener: -102.623775821971 hartree
chargesum: 0.0000000
charge: -0.273402 -0.477612 -0.471979 -0.504713 -0.098967 -0.141787 0.160066 0.037695 -0.157712 -0.272422 -0.300544 -0.297624 0.427116 -0.026399 -0.231386 -0.253693 0.058570 0.322236 0.357625 -0.001162 -0.045867 -0.438605 0.065792 0.105595 0.095428 0.095372 0.092188 0.100210 0.101939 0.103163 0.082935 0.123538 0.094756 0.095049 0.090213 0.096785 0.087823 0.099405 0.142206 0.132284 0.133771 0.125992 0.136118 0.142080 0.287922
qa: -0.2734 -0.4776 -0.4720 -0.5047 -0.0990 -0.1418 0.1601 0.0377 -0.1577 -0.2724 -0.3005 -0.2976 0.4271 -0.0264 -0.2314 -0.2537 0.0586 0.3222 0.3576 -0.0012 -0.0459 -0.4386 0.0658 0.1056 0.0954 0.0954 0.0922 0.1002 0.1019 0.1032 0.0829 0.1235 0.0948 0.0950 0.0902 0.0968 0.0878 0.0994 0.1422 0.1323 0.1338 0.1260 0.1361 0.1421 0.2879
va: 2.1063 2.0226 2.0387 2.0044 3.1221 3.1766 3.6521 3.7389 3.9132 3.9047 3.9066 3.8586 4.1665 3.7046 3.9273 3.9441 3.8903 4.1552 4.2969 3.8985 3.9071 3.7556 3.5690 1.0168 1.0336 1.0026 1.0023 1.0020 1.0023 1.0058 1.0129 1.0077 0.9962 0.9953 1.0076 0.9974 1.0083 0.9979 1.0191 1.0110 1.0029 1.0103 1.0003 0.9869 0.9450
dispcorr: -0.023087794 hartree
energy: -1071.561644262692
dipole: -30.35626 30.55535 0.19909 -11.07365 8.21588 -2.85777 3.40415 -3.40615 -0.00200
magnitude: 2.86470 au
magnitude: 7.28148 debye
