program: Orca
programVersion: 5.0.2
elementType: O O O O N N C C C C C C C C C C C C C C C C C H H H H H H H H H H H H H H H H H H H H H H
charge: 0
multiplicity: 1
keywords: wb97x-d3
keywords: def2-TZVPP
keywords: def2/J RIJCOSX
keywords: DEFGRID2
keywords: scfconv7
keywords: smallprint printgap noloewdin
keywords: NOSOSCF
formula: C17H22N2O4
InChI: InChI=1/C17H22N2O4/c1-6-7-18-9-13(20)19(16(18)22)10-23-15(21)14-12(8-11(2)3)17(14,4)5/h1,8,12,14H,7,9-10H2,2-5H3
45 atoms
O  0.097898 1.011773 0.62767
O  -0.20092 2.870147 1.81874
O  1.804282 1.085422 -2.221198
O  2.592006 -1.279129 1.593746
N  2.100989 0.192966 -0.124687
N  2.871364 -1.818391 -0.629729
C  -2.771606 1.842941 -0.351049
C  -2.729043 0.521103 0.36021
C  -2.114528 1.731461 1.017137
C  -4.072054 2.605789 -0.399315
C  -1.930113 2.032538 -1.58853
C  -3.944518 -0.073464 0.966633
C  -0.667179 1.937985 1.201129
C  -4.609256 -1.131505 0.494096
C  -5.83044 -1.650167 1.191009
C  -4.224389 -1.87862 -0.745825
C  1.506502 1.22805 0.650494
C  2.177896 0.197308 -1.494357
C  2.541495 -1.023225 0.411205
C  2.820293 -1.103681 -1.883126
C  3.676451 -3.006176 -0.46708
C  5.108976 -2.717317 -0.478895
C  6.28214 -2.460698 -0.510105
H  -2.023841 -0.187268 -0.061604
H  -2.686943 2.182426 1.821287
H  -3.888066 3.666992 -0.57564
H  -4.695471 2.238925 -1.217256
H  -4.646911 2.516496 0.521468
H  -1.597085 3.068187 -1.68081
H  -1.05056 1.392863 -1.618811
H  -2.525399 1.801867 -2.473891
H  -4.321531 0.407696 1.864667
H  -6.697559 -1.630053 0.525883
H  -5.697932 -2.692375 1.492541
H  -6.074688 -1.070484 2.081083
H  -5.041592 -1.855598 -1.471264
H  -3.337879 -1.480979 -1.236268
H  -4.042041 -2.932867 -0.523043
H  1.757844 2.194571 0.215356
H  1.892962 1.182514 1.667229
H  2.226921 -1.625885 -2.634666
H  3.815719 -0.914677 -2.297262
H  3.434618 -3.701701 -1.271437
H  3.397994 -3.501781 0.462673
H  7.327595 -2.247123 -0.518503
elementType: O N C H
totalener: -1071.53939813 hartree
nucrepener: 1933.44970547 hartree
electener: -3004.98910359 hartree
oneelecener: -5298.80071486 hartree
twoeener: 2293.81161127 hartree
cpcmener: -0.05079179 hartree
kineticenergy: 1066.86389279 hartree
xcener: -102.623050847708 hartree
chargesum: -0.0000000
charge: -0.267664 -0.491396 -0.473415 -0.508525 -0.122261 -0.170924 0.142997 0.044288 -0.143872 -0.269083 -0.284950 -0.301909 0.429690 -0.028476 -0.228925 -0.254231 0.064272 0.316836 0.405114 0.009431 -0.037103 -0.430975 0.051717 0.102960 0.096766 0.098983 0.096164 0.091383 0.104901 0.078393 0.097183 0.123762 0.094378 0.095181 0.089413 0.096940 0.088893 0.097834 0.142373 0.135760 0.124788 0.128549 0.141491 0.135698 0.287570
qa: -0.2677 -0.4914 -0.4734 -0.5085 -0.1223 -0.1709 0.1430 0.0443 -0.1439 -0.2691 -0.2850 -0.3019 0.4297 -0.0285 -0.2289 -0.2542 0.0643 0.3168 0.4051 0.0094 -0.0371 -0.4310 0.0517 0.1030 0.0968 0.0990 0.0962 0.0914 0.1049 0.0784 0.0972 0.1238 0.0944 0.0952 0.0894 0.0969 0.0889 0.0978 0.1424 0.1358 0.1248 0.1285 0.1415 0.1357 0.2876
va: 2.1111 2.0049 2.0324 2.0097 3.1670 3.1988 3.6737 3.7378 3.9392 3.9077 3.9160 3.8647 4.1231 3.7107 3.9258 3.9444 3.8927 4.1517 4.2888 3.9078 3.9058 3.7371 3.5850 1.0155 1.0335 1.0023 1.0026 1.0025 0.9993 1.0138 1.0029 1.0073 0.9961 0.9954 1.0078 0.9974 1.0084 0.9975 0.9999 1.0074 1.0107 1.0030 0.9871 1.0015 0.9454
dispcorr: -0.021269611 hartree
energy: -1071.560667737143
dipole: -32.13049 32.16228 0.03179 -2.79086 0.63959 -2.15128 -5.95786 3.93938 -2.01848
magnitude: 2.95013 au
magnitude: 7.49864 debye
