program: Orca
programVersion: 5.0.2
elementType: O O O O N N C C C C C C C C C C C C C C C C C H H H H H H H H H H H H H H H H H H H H H H
charge: 0
multiplicity: 1
keywords: wb97x-d3
keywords: def2-TZVPP
keywords: def2/J RIJCOSX
keywords: DEFGRID2
keywords: scfconv7
keywords: smallprint printgap noloewdin
keywords: NOSOSCF
formula: C17H22N2O4
InChI: InChI=1/C17H22N2O4/c1-6-7-18-9-13(20)19(16(18)22)10-23-15(21)14-12(8-11(2)3)17(14,4)5/h1,8,12,14H,7,9-10H2,2-5H3
45 atoms
O  0.249175 1.206761 1.464915
O  -0.36506 -0.856864 0.854212
O  2.006129 2.36307 -0.730205
O  2.584363 -1.851196 0.906874
N  2.187057 0.378164 0.409631
N  2.748807 -1.001767 -1.226829
C  -2.313456 1.230517 -0.727811
C  -3.028485 0.169523 0.046649
C  -1.929982 0.95463 0.718833
C  -2.99537 2.552078 -0.980133
C  -1.380657 0.8216 -1.841856
C  -4.440315 0.317675 0.485566
C  -0.64019 0.308759 1.015438
C  -5.003155 -0.376212 1.478247
C  -6.446307 -0.196368 1.836235
C  -4.261002 -1.380514 2.304289
C  1.591994 0.787441 1.648853
C  2.269325 1.184508 -0.694966
C  2.516743 -0.948405 0.102807
C  2.738295 0.311661 -1.824286
C  3.421751 -2.116632 -1.850304
C  4.87431 -1.960138 -1.872577
C  6.066441 -1.81459 -1.901118
H  -2.738957 -0.844876 -0.215787
H  -2.219122 1.728199 1.422289
H  -2.254644 3.335021 -1.152123
H  -3.627577 2.49532 -1.86883
H  -3.619941 2.869232 -0.145181
H  -1.932742 0.747445 -2.780825
H  -0.595124 1.567207 -1.982425
H  -0.903995 -0.143419 -1.671221
H  -5.057276 1.024295 -0.061766
H  -6.99219 -1.139171 1.748561
H  -6.554129 0.126371 2.874837
H  -6.93889 0.539123 1.200632
H  -4.346536 -1.141601 3.367265
H  -4.692418 -2.377083 2.179019
H  -3.201563 -1.442003 2.060028
H  2.10893 1.656024 2.047213
H  1.670983 -0.028969 2.365004
H  2.053964 0.374512 -2.673008
H  3.732177 0.627847 -2.156221
H  3.049521 -2.223694 -2.870126
H  3.150439 -3.032672 -1.325752
H  7.1267 -1.689241 -1.929362
elementType: O N C H
totalener: -1071.53829587 hartree
nucrepener: 1985.41191734 hartree
electener: -3056.95021320 hartree
oneelecener: -5403.56427543 hartree
twoeener: 2346.61406222 hartree
cpcmener: -0.05115903 hartree
kineticenergy: 1066.85951825 hartree
xcener: -102.623696011297 hartree
chargesum: -0.0000000
charge: -0.278183 -0.475144 -0.472455 -0.505827 -0.116512 -0.152573 0.173586 -0.042632 -0.109336 -0.298650 -0.276841 -0.284203 0.412415 -0.022575 -0.229079 -0.242033 0.071573 0.293276 0.389681 0.001072 -0.040997 -0.438971 0.060864 0.102765 0.101865 0.099144 0.101968 0.092277 0.106301 0.093077 0.089610 0.126958 0.094992 0.095273 0.089627 0.095932 0.100857 0.075645 0.151552 0.139001 0.126867 0.136116 0.142196 0.133525 0.287990
qa: -0.2782 -0.4751 -0.4725 -0.5058 -0.1165 -0.1526 0.1736 -0.0426 -0.1093 -0.2986 -0.2768 -0.2842 0.4124 -0.0226 -0.2291 -0.2420 0.0716 0.2933 0.3897 0.0011 -0.0410 -0.4390 0.0609 0.1028 0.1019 0.0991 0.1020 0.0923 0.1063 0.0931 0.0896 0.1270 0.0950 0.0953 0.0896 0.0959 0.1009 0.0756 0.1516 0.1390 0.1269 0.1361 0.1422 0.1335 0.2880
va: 2.1175 2.0166 2.0288 2.0105 3.1081 3.1779 3.7207 3.8514 3.8183 3.9046 3.8788 3.8785 4.1463 3.7133 3.9279 3.9366 3.8937 4.1729 4.3041 3.9058 3.9030 3.7482 3.5732 1.0223 1.0285 1.0030 0.9981 1.0010 1.0015 1.0100 1.0122 1.0015 0.9955 0.9963 1.0066 0.9988 0.9986 1.0224 0.9923 1.0150 1.0060 1.0051 0.9866 1.0039 0.9450
dispcorr: -0.023308272 hartree
energy: -1071.561604140413
dipole: -30.66634 30.63479 -0.03155 2.44346 -1.93403 0.50943 -1.58202 0.19079 -1.39123
magnitude: 1.48190 au
magnitude: 3.76670 debye
