program: Orca
programVersion: 5.0.2
elementType: O O O O N N C C C C C C C C C C C C C C C C C H H H H H H H H H H H H H H H H H H H H H H
charge: 0
multiplicity: 1
keywords: wb97x-d3
keywords: def2-TZVPP
keywords: def2/J RIJCOSX
keywords: DEFGRID2
keywords: scfconv7
keywords: smallprint printgap noloewdin
keywords: NOSOSCF
formula: C17H22N2O4
InChI: InChI=1/C17H22N2O4/c1-6-7-18-9-13(20)19(16(18)22)10-23-15(21)14-12(8-11(2)3)17(14,4)5/h1,8,12,14H,7,9-10H2,2-5H3
45 atoms
O  0.286199 1.277306 1.46895
O  -0.336509 -0.796375 0.905102
O  2.023243 2.397238 -0.763559
O  2.600168 -1.797041 0.924132
N  2.207794 0.427954 0.402775
N  2.724504 -0.981504 -1.224823
C  -2.302317 1.216449 -0.719292
C  -3.012355 0.201916 0.121337
C  -1.895935 1.015022 0.733265
C  -2.966881 2.533841 -1.032941
C  -1.392089 0.736722 -1.824486
C  -4.411931 0.370526 0.58201
C  -0.607573 0.373017 1.041311
C  -5.040744 -0.449593 1.429166
C  -6.472614 -0.226139 1.809145
C  -4.395787 -1.639685 2.070028
C  1.630541 0.858612 1.643466
C  2.278723 1.217729 -0.714974
C  2.521163 -0.905141 0.10924
C  2.725396 0.325403 -1.837861
C  3.40339 -2.103245 -1.831015
C  4.857731 -1.964351 -1.801325
C  6.051507 -1.831401 -1.785771
H  -2.728412 -0.823505 -0.096062
H  -2.168052 1.827202 1.398866
H  -2.215065 3.286736 -1.275827
H  -3.626816 2.436875 -1.897242
H  -3.556599 2.919501 -0.202156
H  -0.592317 1.457361 -2.00744
H  -0.9359 -0.230788 -1.618372
H  -1.95856 0.634988 -2.751919
H  -4.965722 1.216312 0.185756
H  -7.086228 -1.092094 1.547627
H  -6.575231 -0.091889 2.888958
H  -6.897657 0.648576 1.31734
H  -4.480435 -1.577312 3.157833
H  -4.904106 -2.561915 1.776819
H  -3.339863 -1.745861 1.827068
H  2.154375 1.732568 2.020511
H  1.717502 0.053957 2.371906
H  2.035102 0.387793 -2.681015
H  3.720009 0.624889 -2.181855
H  3.064131 -2.197481 -2.863296
H  3.100797 -3.018938 -1.323545
H  7.112448 -1.71677 -1.769481
elementType: O N C H
totalener: -1071.53859155 hartree
nucrepener: 1983.74054029 hartree
electener: -3055.27913184 hartree
oneelecener: -5400.23086633 hartree
twoeener: 2344.95173450 hartree
cpcmener: -0.05166913 hartree
kineticenergy: 1066.86486915 hartree
xcener: -102.624636927702 hartree
chargesum: -0.0000000
charge: -0.278823 -0.474760 -0.471725 -0.504341 -0.116884 -0.155769 0.163326 -0.058660 -0.079486 -0.301084 -0.273379 -0.265130 0.404842 -0.027368 -0.231609 -0.250840 0.073043 0.295396 0.389241 -0.001641 -0.038740 -0.440325 0.059497 0.102120 0.101502 0.099936 0.104317 0.090106 0.092676 0.090489 0.106404 0.126980 0.094233 0.094896 0.088930 0.096041 0.098762 0.078861 0.151684 0.138916 0.126810 0.137156 0.141432 0.134791 0.288179
qa: -0.2788 -0.4748 -0.4717 -0.5043 -0.1169 -0.1558 0.1633 -0.0587 -0.0795 -0.3011 -0.2734 -0.2651 0.4048 -0.0274 -0.2316 -0.2508 0.0730 0.2954 0.3892 -0.0016 -0.0387 -0.4403 0.0595 0.1021 0.1015 0.0999 0.1043 0.0901 0.0927 0.0905 0.1064 0.1270 0.0942 0.0949 0.0889 0.0960 0.0988 0.0789 0.1517 0.1389 0.1268 0.1372 0.1414 0.1348 0.2882
va: 2.1160 2.0184 2.0299 2.0119 3.1072 3.1733 3.7486 3.8515 3.8196 3.9081 3.8760 3.8827 4.1605 3.7170 3.9294 3.9410 3.8934 4.1696 4.3056 3.9085 3.9043 3.7457 3.5767 1.0179 1.0283 1.0023 0.9981 1.0017 1.0096 1.0137 1.0014 1.0037 0.9954 0.9960 1.0072 0.9978 0.9978 1.0205 0.9923 1.0151 1.0061 1.0047 0.9872 1.0025 0.9449
dispcorr: -0.023090551 hartree
energy: -1071.561682098081
dipole: -31.01005 30.95608 -0.05397 1.49708 -1.02104 0.47604 -2.18485 0.72903 -1.45582
magnitude: 1.53263 au
magnitude: 3.89562 debye
