program: Orca
programVersion: 5.0.2
elementType: O O O O N N C C C C C C C C C C C C C C C C C H H H H H H H H H H H H H H H H H H H H H H
charge: 0
multiplicity: 1
keywords: wb97x-d3
keywords: def2-TZVPP
keywords: def2/J RIJCOSX
keywords: DEFGRID2
keywords: scfconv7
keywords: smallprint printgap noloewdin
keywords: NOSOSCF
formula: C17H22N2O4
InChI: InChI=1/C17H22N2O4/c1-6-7-18-9-13(20)19(16(18)22)10-23-15(21)14-12(8-11(2)3)17(14,4)5/h1,8,12,14H,7,9-10H2,2-5H3
45 atoms
O  0.430372 1.5565 1.629884
O  0.139235 -0.644094 1.349298
O  2.087693 2.688717 -0.649456
O  3.136979 -1.193545 1.495159
N  2.516528 0.911315 0.739074
N  3.606231 -0.446873 -0.628971
C  -2.0749 0.717872 -0.540348
C  -2.663544 -0.178975 0.509925
C  -1.6675 0.867041 0.920504
C  -2.919253 1.832832 -1.102999
C  -1.10155 0.140096 -1.538963
C  -4.077299 -0.053976 0.953293
C  -0.307514 0.477113 1.324859
C  -5.108779 -0.668729 0.369321
C  -6.507346 -0.509063 0.881265
C  -4.967065 -1.550264 -0.832532
C  1.809858 1.371816 1.89977
C  2.53528 1.583887 -0.455166
C  3.089472 -0.359905 0.618995
C  3.194088 0.668175 -1.448065
C  3.941721 -1.72681 -1.210073
C  2.762616 -2.441084 -1.695259
C  1.77726 -3.005583 -2.088166
H  -2.271419 -1.192547 0.494598
H  -2.048521 1.758135 1.408813
H  -3.586532 2.268235 -0.359963
H  -2.288301 2.632779 -1.494737
H  -3.535155 1.464859 -1.926452
H  -1.637391 -0.164806 -2.439838
H  -0.36008 0.884805 -1.83806
H  -0.570759 -0.735917 -1.168431
H  -4.270693 0.581035 1.813081
H  -6.932634 -1.473839 1.169194
H  -6.557007 0.153094 1.745384
H  -7.162468 -0.104018 0.105826
H  -5.340574 -2.555779 -0.622332
H  -5.568894 -1.167269 -1.660559
H  -3.939749 -1.640841 -1.181808
H  2.174788 2.351195 2.196994
H  1.977365 0.670903 2.71596
H  2.468043 0.377086 -2.213719
H  4.036991 1.15651 -1.938966
H  4.471793 -2.328652 -0.472114
H  4.639523 -1.561047 -2.030869
H  0.916357 -3.529091 -2.440201
elementType: O N C H
totalener: -1071.53894325 hartree
nucrepener: 2004.84671676 hartree
electener: -3076.38566001 hartree
oneelecener: -5442.72893160 hartree
twoeener: 2366.34327158 hartree
cpcmener: -0.05505699 hartree
kineticenergy: 1066.86756375 hartree
xcener: -102.624013780726 hartree
chargesum: -0.0000000
charge: -0.279468 -0.471536 -0.473445 -0.503165 -0.113088 -0.161287 0.131901 -0.020417 -0.114603 -0.278019 -0.288441 -0.258926 0.413703 -0.039929 -0.231362 -0.248928 0.072461 0.297515 0.393164 -0.001555 -0.025649 -0.410329 0.020757 0.101730 0.103299 0.093380 0.102716 0.098648 0.104457 0.099919 0.081911 0.122763 0.095955 0.089974 0.094735 0.103400 0.097658 0.087093 0.151936 0.138938 0.129138 0.129882 0.135783 0.140976 0.286354
qa: -0.2795 -0.4715 -0.4734 -0.5032 -0.1131 -0.1613 0.1319 -0.0204 -0.1146 -0.2780 -0.2884 -0.2589 0.4137 -0.0399 -0.2314 -0.2489 0.0725 0.2975 0.3932 -0.0016 -0.0256 -0.4103 0.0208 0.1017 0.1033 0.0934 0.1027 0.0986 0.1045 0.0999 0.0819 0.1228 0.0960 0.0900 0.0947 0.1034 0.0977 0.0871 0.1519 0.1389 0.1291 0.1299 0.1358 0.1410 0.2864
va: 2.1113 2.0359 2.0287 2.0110 3.0978 3.1790 3.6861 3.8222 3.8259 3.9011 3.9027 3.8487 4.2060 3.7091 3.9278 3.9340 3.8874 4.1628 4.3117 3.9248 3.9037 3.7225 3.6261 1.0231 1.0309 1.0025 1.0032 0.9997 1.0031 1.0064 1.0097 1.0059 0.9953 1.0072 0.9961 0.9994 0.9977 1.0080 0.9923 1.0152 0.9986 1.0105 1.0012 0.9878 0.9473
dispcorr: -0.024182268 hartree
energy: -1071.563125517468
dipole: -32.76909 32.74854 -0.02055 -2.55581 2.94455 0.38874 -10.18773 8.38312 -1.80461
magnitude: 1.84612 au
magnitude: 4.69246 debye
