program: Orca
programVersion: 5.0.2
elementType: O O O O N N C C C C C C C C C C C C C C C C C H H H H H H H H H H H H H H H H H H H H H H
charge: 0
multiplicity: 1
keywords: wb97x-d3
keywords: def2-TZVPP
keywords: def2/J RIJCOSX
keywords: DEFGRID2
keywords: scfconv7
keywords: smallprint printgap noloewdin
keywords: NOSOSCF
formula: C17H22N2O4
InChI: InChI=1/C17H22N2O4/c1-6-7-18-9-13(20)19(16(18)22)10-23-15(21)14-12(8-11(2)3)17(14,4)5/h1,8,12,14H,7,9-10H2,2-5H3
45 atoms
O  0.215817 1.587079 0.997493
O  -0.118247 -0.576121 1.458982
O  2.897731 -1.084791 1.884371
O  1.806784 1.717352 -1.5459
N  2.263874 0.5692 0.411121
N  2.661724 -0.422779 -1.521033
C  -2.346243 0.23424 -0.781326
C  -2.892966 -0.384663 0.464615
C  -1.90756 0.75218 0.581219
C  -3.21118 1.171129 -1.586868
C  -1.380935 -0.558998 -1.627907
C  -4.300533 -0.212359 0.905259
C  -0.544226 0.484882 1.068976
C  -4.731467 -0.444118 2.148313
C  -6.176117 -0.298421 2.515275
C  -3.82865 -0.868716 3.265672
C  1.597854 1.476345 1.300076
C  2.754644 -0.663737 0.762896
C  2.207585 0.721698 -0.980298
C  3.104359 -1.361192 -0.523085
C  2.814449 -0.644849 -2.935745
C  4.210676 -0.62891 -3.363814
C  5.359822 -0.633972 -3.713042
H  -2.462095 -1.353794 0.701258
H  -2.295756 1.731594 0.839963
H  -3.861945 1.783347 -0.963508
H  -2.591558 1.847111 -2.178256
H  -3.841814 0.611467 -2.280317
H  -0.708708 0.104965 -2.17591
H  -0.771944 -1.252944 -1.049456
H  -1.930148 -1.148472 -2.364262
H  -5.024169 0.096268 0.156525
H  -6.578203 -1.237753 2.903431
H  -6.305258 0.442297 3.308446
H  -6.787744 0.004928 1.665858
H  -4.087324 -1.873098 3.611175
H  -2.774694 -0.871267 2.992827
H  -3.94855 -0.208871 4.128206
H  1.993666 2.481545 1.187012
H  1.76489 1.144326 2.323923
H  4.18004 -1.549976 -0.572647
H  2.582481 -2.317831 -0.594988
H  2.249711 0.11612 -3.473958
H  2.36736 -1.60653 -3.196494
H  6.380341 -0.635542 -4.024825
elementType: O N C H
totalener: -1071.53751875 hartree
nucrepener: 1991.20164313 hartree
electener: -3062.73916188 hartree
oneelecener: -5415.00065892 hartree
twoeener: 2352.26149704 hartree
cpcmener: -0.05048993 hartree
kineticenergy: 1066.87116691 hartree
xcener: -102.627937960916 hartree
chargesum: -0.0000000
charge: -0.279791 -0.476618 -0.469861 -0.513416 -0.126892 -0.127823 0.180513 -0.044680 -0.105781 -0.300579 -0.281900 -0.282931 0.410848 -0.021705 -0.228680 -0.245334 0.079298 0.314104 0.360355 0.002444 -0.064583 -0.444083 0.090108 0.102727 0.102267 0.091691 0.099214 0.102295 0.093078 0.090871 0.106221 0.126934 0.094777 0.094877 0.089613 0.101040 0.076840 0.095486 0.150049 0.136922 0.131616 0.127088 0.130429 0.145101 0.287852
qa: -0.2798 -0.4766 -0.4699 -0.5134 -0.1269 -0.1278 0.1805 -0.0447 -0.1058 -0.3006 -0.2819 -0.2829 0.4108 -0.0217 -0.2287 -0.2453 0.0793 0.3141 0.3604 0.0024 -0.0646 -0.4441 0.0901 0.1027 0.1023 0.0917 0.0992 0.1023 0.0931 0.0909 0.1062 0.1269 0.0948 0.0949 0.0896 0.1010 0.0768 0.0955 0.1500 0.1369 0.1316 0.1271 0.1304 0.1451 0.2879
va: 2.1152 2.0150 2.0421 1.9957 3.1076 3.2019 3.7197 3.8477 3.8148 3.9043 3.8782 3.8760 4.1457 3.7155 3.9279 3.9377 3.8928 4.1849 4.3069 3.8856 3.9034 3.7911 3.5309 1.0234 1.0284 1.0007 1.0032 0.9982 1.0096 1.0112 1.0019 1.0025 0.9952 0.9964 1.0065 0.9985 1.0224 0.9991 0.9934 1.0146 1.0045 1.0082 1.0073 0.9841 0.9451
dispcorr: -0.023472474 hartree
energy: -1071.560991219660
dipole: -30.46167 30.28897 -0.17269 -3.58770 3.15027 -0.43742 0.91459 -2.19791 -1.28332
magnitude: 1.36677 au
magnitude: 3.47405 debye
