program: Orca
programVersion: 5.0.2
elementType: O O O O N N C C C C C C C C C C C C C C C C C H H H H H H H H H H H H H H H H H H H H H H
charge: 0
multiplicity: 1
keywords: wb97x-d3
keywords: def2-TZVPP
keywords: def2/J RIJCOSX
keywords: DEFGRID2
keywords: scfconv7
keywords: smallprint printgap noloewdin
keywords: NOSOSCF
formula: C17H22N2O4
InChI: InChI=1/C17H22N2O4/c1-6-7-18-9-13(20)19(16(18)22)10-23-15(21)14-12(8-11(2)3)17(14,4)5/h1,8,12,14H,7,9-10H2,2-5H3
45 atoms
O  0.218635 1.03986 1.67716
O  -0.051569 -1.011984 0.824455
O  2.104127 2.677189 -0.037089
O  2.907221 -1.661602 1.103823
N  2.383119 0.587493 0.873525
N  3.585031 -0.405711 -0.700778
C  -1.97755 0.910187 -0.924721
C  -2.702199 -0.215845 -0.260962
C  -1.770633 0.636308 0.560447
C  -2.728233 2.177157 -1.25146
C  -0.873729 0.602257 -1.907151
C  -4.169422 -0.16426 -0.023233
C  -0.479748 0.100448 1.019347
C  -4.791359 -0.624809 1.065168
C  -6.280724 -0.54292 1.205566
C  -4.078865 -1.256502 2.220906
C  1.559322 0.75259 2.036708
C  2.518816 1.544888 -0.099114
C  2.950921 -0.627903 0.476292
C  3.251795 0.893578 -1.236275
C  3.919384 -1.506055 -1.577639
C  2.747826 -2.013008 -2.290442
C  1.767673 -2.409326 -2.86142
H  -2.308486 -1.201804 -0.497745
H  -2.218581 1.368103 1.224253
H  -3.487155 2.416569 -0.50682
H  -2.041729 3.023732 -1.308146
H  -3.225295 2.090319 -2.21976
H  -1.287192 0.531927 -2.915105
H  -0.127991 1.400347 -1.915189
H  -0.361105 -0.337974 -1.704614
H  -4.773469 0.264005 -0.81896
H  -6.557768 0.022751 2.099024
H  -6.750222 -0.066413 0.345063
H  -6.718682 -1.53739 1.323617
H  -3.000848 -1.317405 2.083223
H  -4.272144 -0.702625 3.143469
H  -4.450859 -2.270501 2.389433
H  1.889915 1.6127 2.612863
H  1.639402 -0.1387 2.65696
H  2.585136 0.826859 -2.102651
H  4.134936 1.46592 -1.523022
H  4.38596 -2.301744 -0.996909
H  4.67087 -1.16294 -2.289519
H  0.889404 -2.761181 -3.356044
elementType: O N C H
totalener: -1071.53840822 hartree
nucrepener: 2021.55856764 hartree
electener: -3093.09697586 hartree
oneelecener: -5476.16677919 hartree
twoeener: 2383.06980333 hartree
cpcmener: -0.05403967 hartree
kineticenergy: 1066.86264949 hartree
xcener: -102.623289474309 hartree
chargesum: 0.0000000
charge: -0.278724 -0.474396 -0.471036 -0.500333 -0.111777 -0.160389 0.165482 -0.001804 -0.149072 -0.288686 -0.269003 -0.304484 0.417812 -0.023820 -0.229151 -0.235361 0.073117 0.294229 0.390007 -0.004117 -0.023410 -0.411777 0.018005 0.105373 0.105975 0.094586 0.098558 0.100011 0.106427 0.095419 0.070639 0.125855 0.094536 0.089751 0.096741 0.078978 0.097777 0.102117 0.151628 0.138774 0.129820 0.130457 0.136654 0.140562 0.288052
qa: -0.2787 -0.4744 -0.4710 -0.5003 -0.1118 -0.1604 0.1655 -0.0018 -0.1491 -0.2887 -0.2690 -0.3045 0.4178 -0.0238 -0.2292 -0.2354 0.0731 0.2942 0.3900 -0.0041 -0.0234 -0.4118 0.0180 0.1054 0.1060 0.0946 0.0986 0.1000 0.1064 0.0954 0.0706 0.1259 0.0945 0.0898 0.0967 0.0790 0.0978 0.1021 0.1516 0.1388 0.1298 0.1305 0.1367 0.1406 0.2881
va: 2.1112 2.0239 2.0298 2.0134 3.0970 3.1719 3.7172 3.8113 3.8243 3.9007 3.9000 3.8847 4.1467 3.7199 3.9296 3.9296 3.8900 4.1596 4.3131 3.9293 3.9025 3.7186 3.6320 1.0222 1.0263 1.0018 1.0034 0.9995 1.0030 1.0069 1.0095 1.0023 0.9971 1.0061 0.9958 1.0183 0.9992 0.9993 0.9924 1.0147 0.9976 1.0117 1.0007 0.9883 0.9459
dispcorr: -0.024549892 hartree
energy: -1071.562958107628
dipole: -29.40405 29.58762 0.18357 1.19539 -0.35961 0.83578 -4.54266 3.32340 -1.21926
magnitude: 1.48957 au
magnitude: 3.78618 debye
