program: Orca
programVersion: 5.0.2
elementType: O O O O N N C C C C C C C C C C C C C C C C C H H H H H H H H H H H H H H H H H H H H H H
charge: 0
multiplicity: 1
keywords: wb97x-d3
keywords: def2-TZVPP
keywords: def2/J RIJCOSX
keywords: DEFGRID2
keywords: scfconv7
keywords: smallprint printgap noloewdin
keywords: NOSOSCF
formula: C17H22N2O4
InChI: InChI=1/C17H22N2O4/c1-6-7-18-9-13(20)19(16(18)22)10-23-15(21)14-12(8-11(2)3)17(14,4)5/h1,8,12,14H,7,9-10H2,2-5H3
45 atoms
O  0.903138 1.864784 -0.993893
O  1.170262 1.06813 1.078339
O  -1.561025 2.3467 2.015905
O  -1.756829 0.874034 -2.297191
N  -1.328241 1.781095 -0.210213
N  -2.903072 0.242694 -0.400501
C  3.858922 -0.100711 0.078492
C  2.835518 -1.105811 -0.323234
C  2.639943 0.370876 -0.685576
C  5.145482 -0.077721 -0.715339
C  4.065357 0.255293 1.530648
C  1.957864 -1.791149 0.655398
C  1.529248 1.11401 -0.065323
C  0.790172 -2.360908 0.35644
C  -0.01215 -3.077257 1.398999
C  0.185789 -2.33443 -1.014434
C  -0.220919 2.609314 -0.583114
C  -1.850222 1.683933 1.063574
C  -1.978772 0.938644 -1.117459
C  -2.907481 0.599347 0.989814
C  -3.813779 -0.699137 -0.989025
C  -3.732521 -2.015524 -0.362307
C  -3.679233 -3.089176 0.169844
H  3.094316 -1.707378 -1.190685
H  2.804403 0.619544 -1.72744
H  5.86239 -0.789644 -0.302292
H  4.987629 -0.340301 -1.76236
H  5.604945 0.911747 -0.686916
H  4.494656 1.254726 1.616967
H  3.154441 0.240473 2.120225
H  4.774119 -0.4445 1.978247
H  2.311405 -1.847397 1.679198
H  0.489609 -3.090182 2.365639
H  -0.989007 -2.60419 1.529613
H  -0.206066 -4.112303 1.105003
H  0.22947 -3.323347 -1.479159
H  -0.872129 -2.069361 -0.964332
H  0.673067 -1.628009 -1.683883
H  0.004272 3.253812 0.267459
H  -0.483524 3.215335 -1.447116
H  -2.635517 -0.237647 1.640008
H  -3.87391 0.987912 1.324045
H  -3.576572 -0.77371 -2.051438
H  -4.843905 -0.33284 -0.918582
H  -3.626924 -4.044976 0.63337
totalener: -1071.51332703 hartree
nucrepener: 2064.90922998 hartree
electener: -3136.42255702 hartree
oneelecener: -5562.16417196 hartree
twoeener: 2425.74161494 hartree
kineticenergy: 1066.95014235 hartree
xcener: -102.631651237862 hartree
chargesum: -0.0000000
charge: -0.263056 -0.372536 -0.324792 -0.376045 -0.144782 -0.148849 0.140659 -0.057718 -0.116839 -0.241427 -0.281131 -0.164054 0.344894 0.001253 -0.212093 -0.246955 0.081312 0.254380 0.297253 -0.045402 -0.099018 -0.416844 0.115544 0.095363 0.086823 0.088544 0.071504 0.090504 0.085915 0.106443 0.088456 0.084005 0.084282 0.061300 0.084454 0.104035 0.054706 0.098136 0.129133 0.126314 0.112427 0.106909 0.135903 0.127892 0.253199
qa: -0.2631 -0.3725 -0.3248 -0.3760 -0.1448 -0.1488 0.1407 -0.0577 -0.1168 -0.2414 -0.2811 -0.1641 0.3449 0.0013 -0.2121 -0.2470 0.0813 0.2544 0.2973 -0.0454 -0.0990 -0.4168 0.1155 0.0954 0.0868 0.0885 0.0715 0.0905 0.0859 0.1064 0.0885 0.0840 0.0843 0.0613 0.0845 0.1040 0.0547 0.0981 0.1291 0.1263 0.1124 0.1069 0.1359 0.1279 0.2532
va: 2.1246 2.1059 2.1961 2.1455 3.0845 3.1017 3.7378 3.8901 3.8292 3.9012 3.9093 3.8821 4.1519 3.7140 3.9516 3.9464 3.9270 4.2451 4.3640 3.8888 3.8808 3.7742 3.6054 1.0042 1.0305 1.0045 1.0073 1.0051 1.0049 1.0200 0.9976 1.0137 1.0173 1.0010 0.9963 1.0013 1.0119 1.0122 1.0147 0.9953 1.0028 1.0104 1.0117 0.9841 0.9694
dispcorr: -0.025880284 hartree
energy: -1071.539207317924
dipole: 16.51161 -16.96926 -0.45765 -15.76557 15.03611 -0.72946 2.23734 -2.53538 -0.29804
magnitude: 0.91126 au
magnitude: 2.31624 debye
