program: Orca
programVersion: 5.0.2
elementType: O O O O N N C C C C C C C C C C C C C C C C C H H H H H H H H H H H H H H H H H H H H H H
charge: 0
multiplicity: 1
keywords: wb97x-d3
keywords: def2-TZVPP
keywords: def2/J RIJCOSX
keywords: DEFGRID2
keywords: scfconv7
keywords: smallprint printgap noloewdin
keywords: NOSOSCF
formula: C17H22N2O4
InChI: InChI=1/C17H22N2O4/c1-6-7-18-9-13(20)19(16(18)22)10-23-15(21)14-12(8-11(2)3)17(14,4)5/h1,8,12,14H,7,9-10H2,2-5H3
45 atoms
O  0.210886 0.533401 -0.076499
O  1.696845 0.896587 1.54604
O  -2.314771 -1.391085 1.23306
O  -2.407222 2.474276 -1.181945
N  -2.060506 0.646908 0.196454
N  -3.786748 0.626975 -1.187174
C  3.869476 0.255257 -0.577256
C  3.438005 -1.109973 -0.139352
C  2.391552 -0.068345 -0.547562
C  4.466963 0.362477 -1.961969
C  4.493057 1.224115 0.397797
C  3.565899 -1.598596 1.244289
C  1.450164 0.501793 0.436546
C  3.876168 -2.84479 1.613274
C  3.975809 -3.202693 3.066817
C  4.145811 -3.989445 0.682768
C  -0.81458 1.04035 0.762135
C  -2.678742 -0.554655 0.457091
C  -2.728176 1.386327 -0.788148
C  -3.91154 -0.58362 -0.423216
C  -4.835434 1.135661 -2.030977
C  -6.073124 1.378781 -1.293292
C  -7.085443 1.549073 -0.67296
H  3.552687 -1.875408 -0.898423
H  1.935428 -0.24723 -1.514221
H  5.537619 0.151848 -1.933959
H  4.011006 -0.338952 -2.662295
H  4.335386 1.367665 -2.366881
H  4.347378 2.250409 0.056389
H  4.096487 1.157648 1.405048
H  5.568028 1.04206 0.446845
H  3.389414 -0.877981 2.033211
H  3.270594 -3.997205 3.323889
H  4.972175 -3.578914 3.313232
H  3.768956 -2.351477 3.713942
H  4.072725 -3.732389 -0.371438
H  5.147145 -4.393407 0.851924
H  3.446362 -4.807822 0.870516
H  -0.737397 0.632495 1.769267
H  -0.76895 2.128529 0.805266
H  -3.91301 -1.48061 -1.04836
H  -4.8158 -0.598623 0.193997
H  -5.029699 0.432258 -2.845722
H  -4.480412 2.060474 -2.487454
H  -7.982868 1.71632 -0.127113
totalener: -1071.51804408 hartree
nucrepener: 1893.55136067 hartree
electener: -2965.06940475 hartree
oneelecener: -5219.14933595 hartree
twoeener: 2254.07993120 hartree
kineticenergy: 1066.93195607 hartree
xcener: -102.626555700549 hartree
chargesum: 0.0000000
charge: -0.266513 -0.395010 -0.336826 -0.379548 -0.149142 -0.171433 0.091534 0.032533 -0.082341 -0.239604 -0.253470 -0.209090 0.354062 -0.060537 -0.201969 -0.241985 0.087976 0.233047 0.341486 -0.027148 -0.086036 -0.398278 0.101396 0.083237 0.079112 0.089516 0.069558 0.089850 0.086815 0.103546 0.084889 0.104448 0.083563 0.080925 0.080852 0.076129 0.086347 0.088377 0.125337 0.127523 0.103484 0.110223 0.123610 0.130920 0.248636
qa: -0.2665 -0.3950 -0.3368 -0.3795 -0.1491 -0.1714 0.0915 0.0325 -0.0823 -0.2396 -0.2535 -0.2091 0.3541 -0.0605 -0.2020 -0.2420 0.0880 0.2330 0.3415 -0.0271 -0.0860 -0.3983 0.1014 0.0832 0.0791 0.0895 0.0696 0.0899 0.0868 0.1035 0.0849 0.1044 0.0836 0.0809 0.0809 0.0761 0.0863 0.0884 0.1253 0.1275 0.1035 0.1102 0.1236 0.1309 0.2486
va: 2.1165 2.0927 2.1794 2.1466 3.1348 3.1325 3.7364 3.7955 3.8794 3.9106 3.9170 3.9085 4.1485 3.8333 3.9376 3.9450 3.9035 4.2534 4.3417 3.8878 3.9192 3.7744 3.6387 1.0104 1.0296 1.0038 1.0082 1.0049 1.0024 1.0199 1.0016 1.0255 0.9984 0.9977 1.0130 1.0169 0.9992 0.9990 1.0072 1.0024 1.0101 1.0097 0.9839 1.0102 0.9707
dispcorr: -0.019578047 hartree
energy: -1071.537622128221
dipole: 31.71425 -32.48143 -0.76718 -13.11913 12.46486 -0.65427 1.36623 -2.35884 -0.99261
magnitude: 1.41489 au
magnitude: 3.59637 debye
