program: Orca
programVersion: 5.0.2
elementType: O O O O N N C C C C C C C C C C C C C C C C C H H H H H H H H H H H H H H H H H H H H H H
charge: 0
multiplicity: 1
keywords: wb97x-d3
keywords: def2-TZVPP
keywords: def2/J RIJCOSX
keywords: DEFGRID2
keywords: scfconv7
keywords: smallprint printgap noloewdin
keywords: NOSOSCF
formula: C17H22N2O4
InChI: InChI=1/C17H22N2O4/c1-6-7-18-9-13(20)19(16(18)22)10-23-15(21)14-12(8-11(2)3)17(14,4)5/h1,8,12,14H,7,9-10H2,2-5H3
45 atoms
O  0.908666 1.324937 -0.381872
O  2.061375 2.743301 -1.655176
O  -1.3689 2.144755 2.134485
O  -1.702092 -0.019203 -1.863396
N  -1.336228 1.328599 -0.017031
N  -2.717289 -0.38838 0.172215
C  3.547512 0.067738 0.392204
C  3.018036 -0.720826 -0.764898
C  3.15169 0.788934 -0.884368
C  5.037522 0.009032 0.641422
C  2.750569 0.220324 1.665987
C  1.701636 -1.412011 -0.783272
C  2.013548 1.723101 -1.021059
C  1.373601 -2.456122 -0.021648
C  0.025448 -3.102811 -0.143042
C  2.285843 -3.069567 0.996658
C  -0.265735 2.096499 -0.560109
C  -1.740806 1.372899 1.297641
C  -1.908246 0.254802 -0.710927
C  -2.757039 0.258513 1.453957
C  -3.603208 -1.455843 -0.206317
C  -5.00877 -1.069729 -0.111263
C  -6.158075 -0.744094 -0.004122
H  3.780583 -1.238097 -1.344463
H  3.982364 1.13491 -1.488098
H  5.288792 -0.847242 1.27127
H  5.605422 -0.085436 -0.284964
H  5.384487 0.908722 1.152353
H  2.882112 1.217425 2.089272
H  1.687635 0.044503 1.536559
H  3.113163 -0.4952 2.405948
H  0.976849 -1.069473 -1.513877
H  -0.522573 -3.039647 0.801893
H  -0.579441 -2.635197 -0.919224
H  0.114896 -4.166208 -0.37854
H  2.410926 -4.137811 0.802406
H  3.275282 -2.617352 1.007004
H  1.866459 -2.985142 2.002554
H  -0.200055 3.042895 -0.023829
H  -0.451972 2.288689 -1.616047
H  -2.466611 -0.406654 2.271832
H  -3.744503 0.669847 1.686489
H  -3.422448 -2.332264 0.42351
H  -3.360251 -1.746127 -1.229398
H  -7.179575 -0.458869 0.0750
totalener: -1071.51301484 hartree
nucrepener: 2038.74728605 hartree
electener: -3110.26030089 hartree
oneelecener: -5509.03747313 hartree
twoeener: 2398.77717224 hartree
kineticenergy: 1066.93964384 hartree
xcener: -102.628177343666 hartree
chargesum: -0.0000000
charge: -0.257805 -0.358936 -0.337357 -0.382651 -0.130408 -0.142865 0.050694 -0.013964 -0.071594 -0.246065 -0.252966 -0.197046 0.314390 -0.016478 -0.234536 -0.249189 0.070743 0.224922 0.307885 -0.026058 -0.113395 -0.420285 0.146082 0.100877 0.087868 0.079905 0.074274 0.097627 0.109547 0.091856 0.079755 0.105966 0.072992 0.084838 0.097881 0.097365 0.083366 0.090560 0.128049 0.131333 0.103894 0.112144 0.124754 0.131985 0.250046
qa: -0.2578 -0.3589 -0.3374 -0.3827 -0.1304 -0.1429 0.0507 -0.0140 -0.0716 -0.2461 -0.2530 -0.1970 0.3144 -0.0165 -0.2345 -0.2492 0.0707 0.2249 0.3079 -0.0261 -0.1134 -0.4203 0.1461 0.1009 0.0879 0.0799 0.0743 0.0976 0.1095 0.0919 0.0798 0.1060 0.0730 0.0848 0.0979 0.0974 0.0834 0.0906 0.1280 0.1313 0.1039 0.1121 0.1248 0.1320 0.2500
va: 2.0838 2.1493 2.1763 2.1302 3.1366 3.1170 3.7198 3.8073 3.8420 3.9192 3.8935 3.8770 4.2385 3.6848 3.9414 3.9440 3.9199 4.2458 4.3390 3.8931 3.9395 3.8934 3.5727 1.0058 1.0269 1.0065 1.0090 1.0026 1.0066 1.0105 1.0007 1.0288 0.9960 1.0134 1.0018 1.0043 1.0092 0.9972 1.0033 1.0044 1.0097 1.0095 0.9809 1.0093 0.9698
dispcorr: -0.025735306 hartree
energy: -1071.538750144588
dipole: 17.16073 -17.91409 -0.75337 -18.08907 16.56193 -1.52713 8.32067 -7.36030 0.96037
magnitude: 1.95500 au
magnitude: 4.96921 debye
