program: Orca
programVersion: 5.0.2
elementType: O O O O N N C C C C C C C C C C C C C C C C C H H H H H H H H H H H H H H H H H H H H H H
charge: 0
multiplicity: 1
keywords: wb97x-d3
keywords: def2-TZVPP
keywords: def2/J RIJCOSX
keywords: DEFGRID2
keywords: scfconv7
keywords: smallprint printgap noloewdin
keywords: NOSOSCF
formula: C17H22N2O4
InChI: InChI=1/C17H22N2O4/c1-6-7-18-9-13(20)19(16(18)22)10-23-15(21)14-12(8-11(2)3)17(14,4)5/h1,8,12,14H,7,9-10H2,2-5H3
45 atoms
O  0.816892 1.898071 -1.066701
O  1.196546 1.263342 1.042563
O  -1.627305 2.315745 1.967506
O  -1.58725 0.225518 -2.084783
N  -1.341077 1.508697 -0.174913
N  -2.43176 -0.411668 -0.036862
C  3.921873 0.184621 0.082766
C  2.947987 -0.85991 -0.348874
C  2.706166 0.615226 -0.70517
C  5.221055 0.249045 -0.68892
C  4.099527 0.541802 1.538696
C  2.052325 -1.575979 0.585512
C  1.534055 1.281229 -0.109575
C  1.094866 -2.43114 0.220271
C  0.242399 -3.115115 1.24576
C  0.757198 -2.761263 -1.201602
C  -0.419263 2.472158 -0.696527
C  -1.783028 1.474026 1.132332
C  -1.774846 0.403306 -0.910891
C  -2.548228 0.173596 1.270741
C  -3.221731 -1.532119 -0.469765
C  -4.657054 -1.25988 -0.419854
C  -5.830882 -1.023195 -0.350307
H  3.256603 -1.442598 -1.21123
H  2.87582 0.872605 -1.744092
H  5.650233 1.25152 -0.64787
H  5.951186 -0.44395 -0.267175
H  5.089042 -0.01183 -1.740022
H  4.504255 1.550755 1.631055
H  3.182856 0.509273 2.117536
H  4.817532 -0.142944 1.994113
H  2.189413 -1.390785 1.644295
H  0.332503 -4.202126 1.177465
H  0.502308 -2.818573 2.261004
H  -0.814732 -2.881271 1.088413
H  -0.226614 -2.363697 -1.464649
H  1.46164 -2.351849 -1.922125
H  0.712057 -3.842514 -1.351572
H  -0.29851 3.24905 0.059517
H  -0.807526 2.907051 -1.614386
H  -2.095036 -0.445138 2.050278
H  -3.587463 0.372724 1.549176
H  -2.995725 -2.405636 0.148883
H  -2.923682 -1.780889 -1.489265
H  -6.873106 -0.816574 -0.304247
totalener: -1071.51317934 hartree
nucrepener: 2060.32382788 hartree
electener: -3131.83700722 hartree
oneelecener: -5552.74177129 hartree
twoeener: 2420.90476407 hartree
kineticenergy: 1066.94425365 hartree
xcener: -102.629946644379 hartree
chargesum: -0.0000000
charge: -0.263097 -0.384910 -0.327805 -0.374396 -0.147421 -0.155026 0.136436 -0.062231 -0.078166 -0.240884 -0.272323 -0.144847 0.342716 -0.052226 -0.215360 -0.238344 0.087738 0.255500 0.301883 -0.042002 -0.123068 -0.431395 0.160069 0.084667 0.081026 0.091084 0.089834 0.071582 0.086671 0.102915 0.089429 0.092951 0.096716 0.088414 0.051119 0.085859 0.085290 0.090843 0.128723 0.124754 0.106640 0.116261 0.124779 0.129730 0.249872
qa: -0.2631 -0.3849 -0.3278 -0.3744 -0.1474 -0.1550 0.1364 -0.0622 -0.0782 -0.2409 -0.2723 -0.1448 0.3427 -0.0522 -0.2154 -0.2383 0.0877 0.2555 0.3019 -0.0420 -0.1231 -0.4314 0.1601 0.0847 0.0810 0.0911 0.0898 0.0716 0.0867 0.1029 0.0894 0.0930 0.0967 0.0884 0.0511 0.0859 0.0853 0.0908 0.1287 0.1248 0.1066 0.1163 0.1248 0.1297 0.2499
va: 2.1275 2.0951 2.1952 2.1470 3.0943 3.0994 3.7663 3.8547 3.8567 3.8973 3.9043 3.8778 4.1598 3.7671 3.9385 3.9478 3.9213 4.2309 4.3573 3.8776 3.9705 3.9481 3.5501 1.0086 1.0314 1.0053 1.0044 1.0069 1.0039 1.0240 0.9986 1.0164 1.0022 1.0114 1.0009 1.0066 1.0142 0.9994 1.0145 0.9942 1.0075 1.0136 0.9768 1.0082 0.9699
dispcorr: -0.025298283 hartree
energy: -1071.538477625154
dipole: 18.62387 -18.74902 -0.12515 -15.75630 14.86230 -0.89400 1.91522 -2.10620 -0.19098
magnitude: 0.92270 au
magnitude: 2.34532 debye
