program: Orca
programVersion: 5.0.2
elementType: O O O O N N C C C C C C C C C C C C C C C C C H H H H H H H H H H H H H H H H H H H H H H
charge: 0
multiplicity: 1
keywords: wb97x-d3
keywords: def2-TZVPP
keywords: def2/J RIJCOSX
keywords: DEFGRID2
keywords: scfconv7
keywords: smallprint printgap noloewdin
keywords: NOSOSCF
formula: C17H22N2O4
InChI: InChI=1/C17H22N2O4/c1-6-7-18-9-13(20)19(16(18)22)10-23-15(21)14-12(8-11(2)3)17(14,4)5/h1,8,12,14H,7,9-10H2,2-5H3
45 atoms
O  0.115799 1.021735 0.76935
O  1.76529 1.160331 -0.739353
O  -2.706322 2.94653 2.036182
O  -1.78894 0.54171 -1.724837
N  -1.915852 1.90293 0.141897
N  -3.770652 0.975051 -0.627743
C  1.804673 -1.948053 -0.315873
C  2.909912 -1.42625 0.550994
C  1.527777 -0.797305 0.636375
C  1.175589 -3.265198 0.070812
C  1.83623 -1.720825 -1.806851
C  4.094016 -0.717616 0.022124
C  1.200068 0.545906 0.123364
C  5.360608 -1.107153 0.187417
C  6.489333 -0.294029 -0.37398
C  5.790517 -2.3451 0.915862
C  -0.517034 2.174976 0.256063
C  -2.870851 2.272018 1.059444
C  -2.430017 1.060633 -0.851334
C  -4.168837 1.659378 0.571296
C  -4.621477 0.056356 -1.335465
C  -5.074981 -1.045099 -0.488951
C  -5.459781 -1.927576 0.226329
H  3.113597 -2.04072 1.421783
H  0.957887 -1.062795 1.51903
H  1.728982 -4.097754 -0.367759
H  1.160369 -3.410941 1.151927
H  0.145961 -3.324433 -0.286727
H  0.822694 -1.645279 -2.204384
H  2.37338 -0.824276 -2.100183
H  2.324331 -2.569325 -2.289081
H  3.916634 0.189709 -0.540094
H  7.081494 -0.876659 -1.084535
H  6.134487 0.599128 -0.886139
H  7.175406 0.023049 0.415945
H  4.962868 -2.959464 1.263358
H  6.407874 -2.972359 0.268051
H  6.408497 -2.094416 1.782031
H  -0.391063 3.002349 0.953042
H  -0.110031 2.447028 -0.716219
H  -4.571205 0.978725 1.328051
H  -4.91336 2.439292 0.387381
H  -4.060471 -0.329409 -2.187812
H  -5.48947 0.585731 -1.739092
H  -5.789219 -2.722766 0.851149
totalener: -1071.51642958 hartree
nucrepener: 1929.64591768 hartree
electener: -3001.16234725 hartree
oneelecener: -5291.50211515 hartree
twoeener: 2290.33976789 hartree
kineticenergy: 1066.94055860 hartree
xcener: -102.628883033822 hartree
chargesum: 0.0000000
charge: -0.276759 -0.388695 -0.342691 -0.384187 -0.138936 -0.165489 0.111751 0.005380 -0.092188 -0.246918 -0.250274 -0.230861 0.361545 -0.024143 -0.211709 -0.245493 0.059735 0.237674 0.347230 -0.029762 -0.085267 -0.401416 0.103878 0.086624 0.080930 0.086935 0.069424 0.092557 0.099649 0.099429 0.081601 0.119013 0.081519 0.082528 0.081481 0.076817 0.083586 0.088739 0.116891 0.142575 0.110319 0.103241 0.131342 0.123419 0.248971
qa: -0.2768 -0.3887 -0.3427 -0.3842 -0.1389 -0.1655 0.1118 0.0054 -0.0922 -0.2469 -0.2503 -0.2309 0.3615 -0.0241 -0.2117 -0.2455 0.0597 0.2377 0.3472 -0.0298 -0.0853 -0.4014 0.1039 0.0866 0.0809 0.0869 0.0694 0.0926 0.0996 0.0994 0.0816 0.1190 0.0815 0.0825 0.0815 0.0768 0.0836 0.0887 0.1169 0.1426 0.1103 0.1032 0.1313 0.1234 0.2490
va: 2.1075 2.0978 2.1765 2.1328 3.1045 3.1331 3.7443 3.8208 3.9243 3.9108 3.9252 3.9118 4.1284 3.7646 3.9429 3.9492 3.9049 4.2550 4.3253 3.8949 3.9113 3.7859 3.6337 1.0090 1.0305 1.0044 1.0079 1.0049 1.0061 1.0181 1.0025 1.0266 0.9985 1.0122 0.9974 1.0135 1.0000 0.9983 1.0104 1.0131 1.0119 1.0075 1.0112 0.9837 0.9705
dispcorr: -0.020624593 hartree
energy: -1071.537054171082
dipole: 27.97260 -29.16645 -1.19385 -19.56171 18.74603 -0.81569 -2.14903 2.26586 0.11683
magnitude: 1.45061 au
magnitude: 3.68716 debye
