program: Orca
programVersion: 5.0.2
elementType: O O O O N N C C C C C C C C C C C C C C C C C H H H H H H H H H H H H H H H H H H H H H H
charge: 0
multiplicity: 1
keywords: wb97x-d3
keywords: def2-TZVPP
keywords: def2/J RIJCOSX
keywords: DEFGRID2
keywords: scfconv7
keywords: smallprint printgap noloewdin
keywords: NOSOSCF
formula: C17H22N2O4
InChI: InChI=1/C17H22N2O4/c1-6-7-18-9-13(20)19(16(18)22)10-23-15(21)14-12(8-11(2)3)17(14,4)5/h1,8,12,14H,7,9-10H2,2-5H3
45 atoms
O  0.156474 0.639875 0.969374
O  1.823302 1.082591 -0.469552
O  -2.973884 2.229308 2.186185
O  -1.423294 0.444927 -1.709862
N  -1.876389 1.502146 0.296434
N  -3.555779 0.63419 -0.851856
C  2.023523 -2.03252 -0.58097
C  3.070767 -1.569525 0.372679
C  1.6368 -1.082596 0.540393
C  1.508138 -3.444068 -0.422112
C  2.021299 -1.559953 -2.013976
C  4.18225 -0.670816 -0.027356
C  1.263318 0.314029 0.258903
C  4.809638 0.17513 0.788157
C  5.950069 1.021314 0.311165
C  4.420427 0.377348 2.220054
C  -0.521375 1.826804 0.629928
C  -2.965378 1.699975 1.110612
C  -2.20496 0.802849 -0.870254
C  -4.149972 1.120736 0.361765
C  -4.260059 -0.163424 -1.819595
C  -4.832279 -1.372796 -1.232828
C  -5.319453 -2.345298 -0.727564
H  3.342195 -2.29694 1.134395
H  1.072896 -1.530171 1.350581
H  1.511994 -3.766596 0.619994
H  0.485592 -3.529836 -0.793426
H  2.127592 -4.143865 -0.986223
H  1.002095 -1.530602 -2.40193
H  2.446168 -0.56928 -2.145629
H  2.593844 -2.257416 -2.628752
H  4.515055 -0.735701 -1.058071
H  5.716587 2.083491 0.417569
H  6.852544 0.838334 0.900012
H  6.187931 0.835478 -0.735303
H  3.59378 -0.257373 2.532117
H  5.263706 0.182684 2.887228
H  4.123406 1.415246 2.390278
H  -0.543632 2.492162 1.491657
H  -0.040642 2.326738 -0.209588
H  -4.613628 0.322831 0.949839
H  -4.904354 1.892857 0.185119
H  -3.557108 -0.4241 -2.612109
H  -5.057387 0.425273 -2.283189
H  -5.741646 -3.217306 -0.288913
totalener: -1071.51439941 hartree
nucrepener: 1964.23463524 hartree
electener: -3035.74903466 hartree
oneelecener: -5360.91794336 hartree
twoeener: 2325.16890870 hartree
kineticenergy: 1066.94839789 hartree
xcener: -102.629532475726 hartree
chargesum: 0.0000000
charge: -0.282293 -0.363516 -0.345028 -0.387622 -0.134039 -0.162937 0.129458 -0.057783 -0.090013 -0.245200 -0.275489 -0.173844 0.344834 0.001425 -0.210907 -0.258915 0.054953 0.236936 0.350038 -0.029501 -0.085351 -0.400078 0.102432 0.097072 0.083262 0.069027 0.093295 0.086529 0.095041 0.101997 0.086483 0.082637 0.087416 0.081724 0.077203 0.082672 0.093641 0.091486 0.115870 0.141237 0.110139 0.103132 0.130290 0.124150 0.248137
qa: -0.2823 -0.3635 -0.3450 -0.3876 -0.1340 -0.1629 0.1295 -0.0578 -0.0900 -0.2452 -0.2755 -0.1738 0.3448 0.0014 -0.2109 -0.2589 0.0550 0.2369 0.3500 -0.0295 -0.0854 -0.4001 0.1024 0.0971 0.0833 0.0690 0.0933 0.0865 0.0950 0.1020 0.0865 0.0826 0.0874 0.0817 0.0772 0.0827 0.0936 0.0915 0.1159 0.1412 0.1101 0.1031 0.1303 0.1242 0.2481
va: 2.0912 2.1217 2.1757 2.1280 3.0996 3.1322 3.7637 3.9097 3.7936 3.9029 3.9130 3.9038 4.1408 3.7510 3.9419 3.9479 3.9055 4.2559 4.3171 3.8941 3.9103 3.7855 3.6329 1.0035 1.0308 1.0074 1.0046 1.0049 1.0112 1.0179 0.9974 1.0111 0.9989 0.9983 1.0112 1.0082 1.0014 1.0000 1.0130 1.0158 1.0114 1.0070 1.0120 0.9834 0.9710
dispcorr: -0.021764236 hartree
energy: -1071.536163651265
dipole: 25.23420 -26.36790 -1.13370 -11.03846 10.37177 -0.66668 -0.75896 0.65080 -0.10816
magnitude: 1.31964 au
magnitude: 3.35425 debye
