program: Orca
programVersion: 5.0.2
elementType: O O O O N N C C C C C C C C C C C C C C C C C H H H H H H H H H H H H H H H H H H H H H H
charge: 0
multiplicity: 1
keywords: wb97x-d3
keywords: def2-TZVPP
keywords: def2/J RIJCOSX
keywords: DEFGRID2
keywords: scfconv7
keywords: smallprint printgap noloewdin
keywords: NOSOSCF
formula: C17H22N2O4
InChI: InChI=1/C17H22N2O4/c1-6-7-18-9-13(20)19(16(18)22)10-23-15(21)14-12(8-11(2)3)17(14,4)5/h1,8,12,14H,7,9-10H2,2-5H3
45 atoms
O  0.406425 1.406762 -0.395084
O  1.600491 0.96468 1.453013
O  -1.341361 -0.889114 1.033047
O  -2.892336 2.6724 -1.35076
N  -1.853867 1.09501 -0.010986
N  -3.668752 0.512389 -1.136865
C  3.850347 0.001039 -0.419948
C  2.903425 -1.157393 -0.421191
C  2.383447 0.247214 -0.699535
C  4.753966 0.152621 -1.62197
C  4.49677 0.457511 0.864474
C  2.50581 -1.900208 0.803834
C  1.470097 0.891976 0.264139
C  3.288559 -2.769128 1.443309
C  2.797005 -3.517613 2.645315
C  4.696186 -3.076465 1.033033
C  -0.697668 1.852963 0.361792
C  -2.04988 -0.22033 0.334582
C  -2.830102 1.560662 -0.900375
C  -3.336973 -0.64001 -0.344649
C  -4.944249 0.673621 -1.783686
C  -6.054858 0.645915 -0.833899
C  -6.945359 0.600443 -0.031714
H  2.929597 -1.769679 -1.320228
H  2.127497 0.447023 -1.733485
H  5.052305 1.193632 -1.757552
H  5.663776 -0.437936 -1.495234
H  4.272528 -0.177007 -2.543829
H  5.460203 -0.043395 0.978579
H  4.687437 1.531672 0.838062
H  3.902045 0.24203 1.74569
H  1.494266 -1.753193 1.167701
H  3.425267 -3.314978 3.516432
H  1.772863 -3.249861 2.90121
H  2.833467 -4.597523 2.479664
H  5.395667 -2.838547 1.838725
H  4.813778 -4.143685 0.82672
H  5.01002 -2.529359 0.145918
H  -0.513179 1.742129 1.42903
H  -0.891408 2.897203 0.124061
H  -3.176444 -1.536825 -0.948392
H  -4.102393 -0.866733 0.405175
H  -5.08164 -0.114797 -2.528865
H  -4.931849 1.621261 -2.323462
H  -7.743449 0.573561 0.670839
totalener: -1071.51491254 hartree
nucrepener: 1939.13527294 hartree
electener: -3010.65018548 hartree
oneelecener: -5310.60663942 hartree
twoeener: 2299.95645393 hartree
kineticenergy: 1066.94055682 hartree
xcener: -102.626986414623 hartree
chargesum: 0.0000000
charge: -0.277509 -0.361874 -0.349640 -0.382733 -0.134101 -0.173199 0.075560 -0.050906 -0.064032 -0.241412 -0.259666 -0.169684 0.324653 -0.029551 -0.211329 -0.254562 0.056789 0.241445 0.344251 -0.021135 -0.082862 -0.395663 0.096939 0.096992 0.083012 0.093748 0.082487 0.072501 0.076660 0.094452 0.116478 0.110304 0.082312 0.086107 0.081172 0.092124 0.095473 0.078020 0.141766 0.121096 0.102961 0.109803 0.122957 0.131152 0.248646
qa: -0.2775 -0.3619 -0.3496 -0.3827 -0.1341 -0.1732 0.0756 -0.0509 -0.0640 -0.2414 -0.2597 -0.1697 0.3247 -0.0296 -0.2113 -0.2546 0.0568 0.2414 0.3443 -0.0211 -0.0829 -0.3957 0.0969 0.0970 0.0830 0.0937 0.0825 0.0725 0.0767 0.0945 0.1165 0.1103 0.0823 0.0861 0.0812 0.0921 0.0955 0.0780 0.1418 0.1211 0.1030 0.1098 0.1230 0.1312 0.2486
va: 2.1003 2.1301 2.1672 2.1442 3.1068 3.1384 3.7220 3.8849 3.8274 3.9035 3.9008 3.8906 4.1773 3.7474 3.9384 3.9358 3.8983 4.2350 4.3416 3.8923 3.9248 3.7721 3.6441 1.0042 1.0301 1.0046 1.0067 1.0076 0.9995 1.0063 1.0167 1.0163 0.9991 1.0120 0.9977 0.9978 1.0037 1.0086 1.0149 1.0135 1.0116 1.0098 0.9842 1.0093 0.9708
dispcorr: -0.021945955 hartree
energy: -1071.536858499253
dipole: 30.64709 -31.35106 -0.70397 -15.81969 14.98806 -0.83163 3.59237 -4.32072 -0.72835
magnitude: 1.31060 au
magnitude: 3.33129 debye
