program: Orca
programVersion: 5.0.2
elementType: O O O O N N C C C C C C C C C C C C C C C C C H H H H H H H H H H H H H H H H H H H H H H
charge: 0
multiplicity: 1
keywords: wb97x-d3
keywords: def2-TZVPP
keywords: def2/J RIJCOSX
keywords: DEFGRID2
keywords: scfconv7
keywords: smallprint printgap noloewdin
keywords: NOSOSCF
formula: C17H22N2O4
InChI: InChI=1/C17H22N2O4/c1-6-7-18-9-13(20)19(16(18)22)10-23-15(21)14-12(8-11(2)3)17(14,4)5/h1,8,12,14H,7,9-10H2,2-5H3
45 atoms
O  0.417194 1.478299 -0.324156
O  1.535118 0.822089 1.506417
O  -1.345645 -0.736416 1.312439
O  -2.844683 2.606438 -1.397521
N  -1.841323 1.146585 0.095133
N  -3.636405 0.479266 -1.003672
C  3.813814 0.00789 -0.427152
C  2.881572 -1.158845 -0.461367
C  2.337419 0.249455 -0.681988
C  4.696924 0.218025 -1.634499
C  4.473575 0.430126 0.861459
C  2.514238 -1.96013 0.736294
C  1.432982 0.856812 0.306603
C  3.314444 -2.860087 1.312995
C  2.856862 -3.669974 2.488074
C  4.71103 -3.142681 0.853546
C  -0.694016 1.93521 0.42657
C  -2.049557 -0.131396 0.542851
C  -2.80413 1.529815 -0.84823
C  -3.313222 -0.610256 -0.119808
C  -4.862601 0.533786 -1.757735
C  -6.02938 0.776286 -0.911128
C  -6.98604 0.964685 -0.209517
H  2.904528 -1.72869 -1.387507
H  2.07622 0.482371 -1.707449
H  5.616497 -0.36423 -1.542028
H  4.205453 -0.084277 -2.560431
H  4.979915 1.267833 -1.735922
H  3.919087 0.15128 1.752349
H  5.458545 -0.036265 0.930326
H  4.626799 1.51106 0.882768
H  1.508381 -1.843981 1.128634
H  3.529399 -3.536762 3.339857
H  1.850673 -3.399834 2.809248
H  2.861786 -4.738692 2.256586
H  4.998382 -2.573534 -0.029299
H  5.433112 -2.923947 1.644959
H  4.829053 -4.20405 0.617387
H  -0.510011 1.885098 1.497631
H  -0.887666 2.968054 0.147625
H  -3.138695 -1.544627 -0.658155
H  -4.089318 -0.785569 0.631724
H  -4.988968 -0.407098 -2.297593
H  -4.779752 1.316093 -2.513059
H  -7.830731 1.134011 0.420639
elementType: O N C H
totalener: -1071.54333758 hartree
nucrepener: 1939.25350990 hartree
electener: -3010.79684749 hartree
oneelecener: -5311.45680982 hartree
twoeener: 2300.65996233 hartree
cpcmener: -0.04204918 hartree
kineticenergy: 1066.86067238 hartree
xcener: -102.622318760576 hartree
chargesum: 0.0000000
charge: -0.286557 -0.444508 -0.451217 -0.485518 -0.116900 -0.159259 0.092629 -0.012458 -0.076284 -0.266951 -0.294722 -0.256544 0.379157 -0.024645 -0.227471 -0.265231 0.066871 0.302055 0.386111 0.006802 -0.055322 -0.426092 0.064682 0.114767 0.095126 0.091224 0.087814 0.097936 0.101191 0.094004 0.109169 0.114538 0.092600 0.089371 0.094547 0.090055 0.100197 0.105508 0.141139 0.129930 0.122014 0.124251 0.140327 0.131878 0.283784
qa: -0.2866 -0.4445 -0.4512 -0.4855 -0.1169 -0.1593 0.0926 -0.0125 -0.0763 -0.2670 -0.2947 -0.2565 0.3792 -0.0246 -0.2275 -0.2652 0.0669 0.3021 0.3861 0.0068 -0.0553 -0.4261 0.0647 0.1148 0.0951 0.0912 0.0878 0.0979 0.1012 0.0940 0.1092 0.1145 0.0926 0.0894 0.0945 0.0901 0.1002 0.1055 0.1411 0.1299 0.1220 0.1243 0.1403 0.1319 0.2838
va: 2.1064 2.0527 2.0656 2.0422 3.1195 3.1896 3.7014 3.8044 3.8443 3.9033 3.8871 3.8648 4.1252 3.7081 3.9270 3.9326 3.8887 4.1837 4.3154 3.8909 3.9026 3.7385 3.5759 1.0049 1.0290 1.0035 1.0048 1.0020 1.0161 0.9986 1.0019 1.0131 0.9969 1.0075 0.9963 1.0062 0.9965 1.0007 1.0160 1.0150 1.0098 1.0043 0.9858 1.0046 0.9477
dispcorr: -0.021934765 hartree
energy: -1071.565272350198
dipole: 30.76257 -31.56127 -0.79870 -16.27073 15.00376 -1.26696 2.49058 -3.75083 -1.26025
magnitude: 1.95738 au
magnitude: 4.97527 debye
