program: Orca
programVersion: 5.0.2
elementType: O O O O N N C C C C C C C C C C C C C C C C C H H H H H H H H H H H H H H H H H H H H H H
charge: 0
multiplicity: 1
keywords: wb97x-d3
keywords: def2-TZVPP
keywords: def2/J RIJCOSX
keywords: DEFGRID2
keywords: scfconv7
keywords: smallprint printgap noloewdin
keywords: NOSOSCF
formula: C17H22N2O4
InChI: InChI=1/C17H22N2O4/c1-6-7-18-9-13(20)19(16(18)22)10-23-15(21)14-12(8-11(2)3)17(14,4)5/h1,8,12,14H,7,9-10H2,2-5H3
45 atoms
O  1.064885 1.212772 -0.017448
O  1.577178 1.627199 -2.156762
O  -1.45373 1.688954 2.469131
O  -1.579412 0.849744 -2.005542
N  -1.239267 1.505107 0.186964
N  -3.107265 0.4443 -0.330461
C  3.816133 -0.12462 0.129843
C  2.79262 -1.192641 -0.042736
C  2.819019 -0.01257 -1.015414
C  5.228887 -0.439284 -0.304745
C  3.772302 0.815447 1.309243
C  1.692895 -1.427676 0.924475
C  1.772635 1.01512 -1.134219
C  0.569474 -2.092825 0.645061
C  -0.490175 -2.300979 1.682224
C  0.253983 -2.624506 -0.72028
C  0.015233 2.163369 -0.002287
C  -1.862944 1.326996 1.395259
C  -1.955382 0.90899 -0.85782
C  -3.153548 0.607881 1.100129
C  -4.016296 -0.410392 -1.050815
C  -3.762665 -1.828029 -0.796747
C  -3.537933 -2.985959 -0.5693
H  3.160046 -2.096594 -0.52262
H  3.236885 -0.23626 -1.990217
H  5.764535 0.469793 -0.58588
H  5.783862 -0.912577 0.508061
H  5.252485 -1.116511 -1.159521
H  4.222944 1.775461 1.049441
H  2.775416 1.011841 1.693486
H  4.357626 0.394275 2.129431
H  1.828026 -1.044152 1.931373
H  -1.44587 -1.884451 1.353039
H  -0.668636 -3.365199 1.859503
H  -0.232105 -1.837821 2.634913
H  -0.262176 -3.585142 -0.662745
H  -0.414227 -1.942059 -1.254373
H  1.138525 -2.759421 -1.341941
H  0.186576 2.826492 0.842438
H  -0.012885 2.752656 -0.915825
H  -3.184316 -0.347163 1.631548
H  -4.008374 1.208134 1.422022
H  -3.930172 -0.200344 -2.117418
H  -5.040397 -0.161092 -0.766421
H  -3.332181 -4.013422 -0.368139
elementType: O N C H
totalener: -1071.54127341 hartree
nucrepener: 2075.20183351 hartree
electener: -3146.74310692 hartree
oneelecener: -5582.90217619 hartree
twoeener: 2436.15906927 hartree
cpcmener: -0.04541888 hartree
kineticenergy: 1066.87707019 hartree
xcener: -102.628105189620 hartree
chargesum: -0.0000000
charge: -0.261168 -0.458126 -0.447855 -0.478284 -0.089934 -0.136711 0.131505 -0.033028 -0.141642 -0.266252 -0.289950 -0.219841 0.421531 -0.008747 -0.232167 -0.299181 0.047702 0.286224 0.359664 -0.027917 -0.035539 -0.397150 0.022059 0.110531 0.091836 0.096407 0.093286 0.086844 0.103201 0.089574 0.098824 0.122745 0.056542 0.110315 0.097587 0.102368 0.093905 0.103552 0.127190 0.144453 0.133479 0.135903 0.133857 0.140206 0.282204
qa: -0.2612 -0.4581 -0.4479 -0.4783 -0.0899 -0.1367 0.1315 -0.0330 -0.1416 -0.2663 -0.2900 -0.2198 0.4215 -0.0087 -0.2322 -0.2992 0.0477 0.2862 0.3597 -0.0279 -0.0355 -0.3971 0.0221 0.1105 0.0918 0.0964 0.0933 0.0868 0.1032 0.0896 0.0988 0.1227 0.0565 0.1103 0.0976 0.1024 0.0939 0.1036 0.1272 0.1445 0.1335 0.1359 0.1339 0.1402 0.2822
va: 2.0961 2.0538 2.0666 2.0393 3.1026 3.1733 3.7497 3.7934 3.8617 3.9026 3.9034 3.8112 4.1262 3.6490 3.9348 3.9543 3.8788 4.1701 4.3166 3.9077 3.8945 3.7235 3.6319 1.0042 1.0294 1.0017 1.0022 1.0056 1.0004 1.0129 0.9989 1.0014 0.9915 0.9981 1.0133 0.9982 1.0018 1.0100 1.0139 1.0209 0.9919 1.0101 1.0040 0.9864 0.9511
dispcorr: -0.027034378 hartree
energy: -1071.568307786001
dipole: 14.49045 -15.81162 -1.32117 -13.70763 12.64201 -1.06561 6.03041 -4.76028 1.27013
magnitude: 2.11996 au
magnitude: 5.38852 debye
