program: Orca
programVersion: 5.0.2
elementType: O O O O N N C C C C C C C C C C C C C C C C C H H H H H H H H H H H H H H H H H H H H H H
charge: 0
multiplicity: 1
keywords: wb97x-d3
keywords: def2-TZVPP
keywords: def2/J RIJCOSX
keywords: DEFGRID2
keywords: scfconv7
keywords: smallprint printgap noloewdin
keywords: NOSOSCF
formula: C17H22N2O4
InChI: InChI=1/C17H22N2O4/c1-6-7-18-9-13(20)19(16(18)22)10-23-15(21)14-12(8-11(2)3)17(14,4)5/h1,8,12,14H,7,9-10H2,2-5H3
45 atoms
O  0.182209 0.185464 -0.026799
O  2.068042 1.244414 0.512528
O  -2.473476 -0.068936 2.165584
O  -2.059729 1.901353 -1.921513
N  -1.938873 1.018493 0.213963
N  -3.871177 0.962906 -0.850076
C  3.475158 -0.954871 -1.204595
C  3.424798 -1.496967 0.179167
C  2.146586 -0.949796 -0.464078
C  3.548503 -1.951049 -2.337927
C  4.20834 0.328859 -1.504216
C  4.081924 -0.826987 1.328197
C  1.517265 0.272992 0.052302
C  3.670696 -0.928504 2.594164
C  4.395161 -0.243965 3.711809
C  2.434369 -1.681232 2.985636
C  -0.563621 1.295466 0.456632
C  -2.771679 0.356553 1.078777
C  -2.587773 1.352508 -0.982419
C  -4.113292 0.28217 0.395318
C  -4.856494 1.067488 -1.895376
C  -5.155093 -0.220664 -2.517362
C  -5.419866 -1.28204 -3.013019
H  3.398209 -2.582086 0.248047
H  1.436728 -1.700772 -0.790552
H  3.102951 -1.543556 -3.247631
H  4.587346 -2.202858 -2.560825
H  3.027394 -2.879523 -2.100019
H  3.77101 0.826922 -2.371755
H  4.213064 1.039617 -0.683017
H  5.248334 0.103224 -1.748424
H  4.968161 -0.236072 1.116076
H  3.727373 0.432322 4.252547
H  4.761588 -0.967065 4.445435
H  5.246412 0.337175 3.356885
H  2.549529 -2.150756 3.964722
H  1.578501 -1.002809 3.064941
H  2.16416 -2.459982 2.27285
H  -0.41035 1.431291 1.527399
H  -0.285588 2.212345 -0.061922
H  -4.408388 -0.761299 0.251875
H  -4.879937 0.776886 0.997198
H  -4.498295 1.772254 -2.646403
H  -5.775014 1.491745 -1.483022
H  -5.633321 -2.22687 -3.46148
elementType: O N C H
totalener: -1071.54554773 hartree
nucrepener: 1929.00128261 hartree
electener: -3000.54683034 hartree
oneelecener: -5290.71815678 hartree
twoeener: 2290.17132644 hartree
cpcmener: -0.04131163 hartree
kineticenergy: 1066.86116164 hartree
xcener: -102.621930275946 hartree
chargesum: 0.0000000
charge: -0.283676 -0.462970 -0.447267 -0.485808 -0.130552 -0.152796 0.125617 -0.025787 -0.077363 -0.261249 -0.296802 -0.259821 0.385760 -0.015875 -0.224481 -0.274841 0.079204 0.297199 0.385826 -0.002732 -0.057835 -0.426491 0.067750 0.111003 0.090786 0.096099 0.093322 0.085994 0.100646 0.096212 0.099069 0.120397 0.096148 0.093880 0.087941 0.103168 0.101581 0.097652 0.133765 0.131740 0.126204 0.124236 0.130772 0.140995 0.283381
qa: -0.2837 -0.4630 -0.4473 -0.4858 -0.1306 -0.1528 0.1256 -0.0258 -0.0774 -0.2612 -0.2968 -0.2598 0.3858 -0.0159 -0.2245 -0.2748 0.0792 0.2972 0.3858 -0.0027 -0.0578 -0.4265 0.0678 0.1110 0.0908 0.0961 0.0933 0.0860 0.1006 0.0962 0.0991 0.1204 0.0961 0.0939 0.0879 0.1032 0.1016 0.0977 0.1338 0.1317 0.1262 0.1242 0.1308 0.1410 0.2834
va: 2.1012 2.0243 2.0709 2.0400 3.1462 3.1906 3.7531 3.8271 3.8508 3.8997 3.8965 3.8374 4.0742 3.7119 3.9297 3.9481 3.9001 4.1987 4.3102 3.8941 3.8943 3.7416 3.5700 1.0054 1.0297 1.0024 1.0026 1.0049 1.0008 1.0152 0.9981 1.0004 0.9949 0.9967 1.0076 1.0019 0.9988 1.0016 0.9991 1.0051 1.0061 1.0064 1.0074 0.9847 0.9480
dispcorr: -0.020996511 hartree
energy: -1071.566544241383
dipole: 26.13185 -27.93798 -1.80613 -9.76062 8.82544 -0.93517 4.50537 -4.82376 -0.31840
magnitude: 2.05865 au
magnitude: 5.23267 debye
