program: Orca
programVersion: 5.0.2
elementType: O O O O N N C C C C C C C C C C C C C C C C C H H H H H H H H H H H H H H H H H H H H H H
charge: 0
multiplicity: 1
keywords: wb97x-d3
keywords: def2-TZVPP
keywords: def2/J RIJCOSX
keywords: DEFGRID2
keywords: scfconv7
keywords: smallprint printgap noloewdin
keywords: NOSOSCF
formula: C17H22N2O4
InChI: InChI=1/C17H22N2O4/c1-6-7-18-9-13(20)19(16(18)22)10-23-15(21)14-12(8-11(2)3)17(14,4)5/h1,8,12,14H,7,9-10H2,2-5H3
45 atoms
O  0.930919 1.056225 -0.432196
O  2.350534 2.186815 -1.717008
O  -0.97895 2.359818 1.925001
O  -2.107618 0.205372 -1.925881
N  -1.296507 1.47999 -0.170885
N  -3.159261 0.33662 0.119607
C  3.489023 -0.008924 0.943527
C  2.961671 -1.065839 0.035036
C  3.184098 0.341963 -0.506647
C  4.958942 -0.04522 1.28998
C  2.636154 0.523722 2.068662
C  1.63415 -1.702205 0.236718
C  2.136835 1.279303 -0.944229
C  0.856027 -2.195314 -0.728706
C  -0.429383 -2.897437 -0.413608
C  1.172381 -2.069744 -2.186108
C  -0.110284 1.954113 -0.797832
C  -1.612183 1.693754 1.145933
C  -2.200087 0.605196 -0.787373
C  -2.884762 0.930064 1.40262
C  -4.241185 -0.587149 -0.105497
C  -4.035921 -1.860596 0.581619
C  -3.863852 -2.899047 1.159587
H  3.717938 -1.747919 -0.346989
H  4.065262 0.453484 -1.128309
H  5.333604 0.953368 1.523718
H  5.131347 -0.676929 2.164053
H  5.561089 -0.442467 0.471737
H  1.567125 0.486891 1.876658
H  2.820863 -0.060744 2.972371
H  2.897519 1.559652 2.293129
H  1.309662 -1.818801 1.267443
H  -0.656281 -2.884188 0.652747
H  -1.26704 -2.441751 -0.946345
H  -0.394602 -3.94167 -0.736501
H  0.416983 -1.454363 -2.683633
H  2.146339 -1.623696 -2.380708
H  1.146267 -3.045147 -2.678705
H  0.106692 2.964279 -0.451049
H  -0.256909 1.969997 -1.876785
H  -2.721563 0.181143 2.182673
H  -3.681943 1.601366 1.730691
H  -4.34305 -0.753966 -1.178336
H  -5.177075 -0.135108 0.231291
H  -3.705466 -3.821545 1.672389
elementType: O N C H
totalener: -1071.54301671 hartree
nucrepener: 2056.24149113 hartree
electener: -3127.78450783 hartree
oneelecener: -5544.79445135 hartree
twoeener: 2417.00994352 hartree
cpcmener: -0.04060981 hartree
kineticenergy: 1066.87550294 hartree
xcener: -102.625970581256 hartree
chargesum: -0.0000000
charge: -0.250908 -0.469278 -0.445994 -0.486840 -0.107600 -0.131479 0.141653 -0.013877 -0.152501 -0.268988 -0.288725 -0.249346 0.422743 -0.034692 -0.230568 -0.263019 0.053111 0.287109 0.355247 0.007690 -0.053547 -0.427648 0.057438 0.114062 0.096031 0.096338 0.092829 0.086485 0.081314 0.099503 0.104310 0.121170 0.089931 0.076740 0.109911 0.093125 0.093874 0.105413 0.141875 0.133585 0.127444 0.123860 0.134015 0.142912 0.285293
qa: -0.2509 -0.4693 -0.4460 -0.4868 -0.1076 -0.1315 0.1417 -0.0139 -0.1525 -0.2690 -0.2887 -0.2493 0.4227 -0.0347 -0.2306 -0.2630 0.0531 0.2871 0.3552 0.0077 -0.0535 -0.4276 0.0574 0.1141 0.0960 0.0963 0.0928 0.0865 0.0813 0.0995 0.1043 0.1212 0.0899 0.0767 0.1099 0.0931 0.0939 0.1054 0.1419 0.1336 0.1274 0.1239 0.1340 0.1429 0.2853
va: 2.1039 2.0372 2.0669 2.0241 3.1489 3.1939 3.7141 3.7909 3.8823 3.9092 3.9207 3.8372 4.0911 3.7080 3.9159 3.9437 3.9066 4.1932 4.3143 3.8942 3.8849 3.7329 3.5843 1.0049 1.0279 1.0016 1.0021 1.0054 1.0052 1.0002 1.0013 0.9982 1.0046 1.0047 0.9974 1.0071 1.0043 1.0004 0.9988 1.0092 1.0061 1.0064 1.0061 0.9854 0.9478
dispcorr: -0.025993592 hartree
energy: -1071.569010298756
dipole: 13.21346 -14.89503 -1.68157 -14.15920 12.86704 -1.29216 4.42360 -3.01254 1.41106
magnitude: 2.54724 au
magnitude: 6.47457 debye
