program: Orca
programVersion: 5.0.2
elementType: O O O O N N C C C C C C C C C C C C C C C C C H H H H H H H H H H H H H H H H H H H H H H
charge: 0
multiplicity: 1
keywords: wb97x-d3
keywords: def2-TZVPP
keywords: def2/J RIJCOSX
keywords: DEFGRID2
keywords: scfconv7
keywords: smallprint printgap noloewdin
keywords: NOSOSCF
formula: C17H22N2O4
InChI: InChI=1/C17H22N2O4/c1-6-7-18-9-13(20)19(16(18)22)10-23-15(21)14-12(8-11(2)3)17(14,4)5/h1,8,12,14H,7,9-10H2,2-5H3
45 atoms
O  0.948796 1.087511 -0.405701
O  2.348604 2.180275 -1.744191
O  -0.988265 2.303258 1.953306
O  -2.073976 0.230311 -1.954528
N  -1.286366 1.469645 -0.164095
N  -3.119528 0.273234 0.098335
C  3.504791 -0.000167 0.932821
C  2.951977 -1.054178 0.036527
C  3.189224 0.349117 -0.515295
C  4.978893 -0.060149 1.259296
C  2.678902 0.551255 2.069056
C  1.614077 -1.663561 0.251532
C  2.144515 1.29187 -0.947436
C  0.826435 -2.156129 -0.706529
C  -0.474901 -2.825046 -0.38254
C  1.149004 -2.059289 -2.164841
C  -0.10248 1.972112 -0.773583
C  -1.60809 1.645187 1.156797
C  -2.172025 0.592494 -0.803928
C  -2.867398 0.853014 1.39201
C  -4.205829 -0.637071 -0.159319
C  -4.06438 -1.889583 0.579646
C  -3.950185 -2.908028 1.205383
H  3.692824 -1.751316 -0.348734
H  4.064114 0.446073 -1.148138
H  5.372297 0.931796 1.490691
H  5.152324 -0.696844 2.129381
H  5.564178 -0.464658 0.432352
H  1.606984 0.541341 1.891451
H  2.86177 -0.037958 2.970152
H  2.968792 1.580343 2.290681
H  1.285104 -1.751846 1.283529
H  -1.297166 -2.380843 -0.947986
H  -0.451675 -3.8825 -0.660623
H  -0.717754 -2.763387 0.678503
H  0.415273 -1.425514 -2.671389
H  2.137307 -1.647452 -2.3623
H  1.092197 -3.039218 -2.645688
H  0.095549 2.981146 -0.411956
H  -0.238863 1.999061 -1.853667
H  -2.697045 0.095657 2.162431
H  -3.680116 1.504736 1.722599
H  -4.246427 -0.838122 -1.230246
H  -5.152724 -0.16102 0.107419
H  -3.852228 -3.815427 1.757817
elementType: O N C H
totalener: -1071.54275456 hartree
nucrepener: 2059.28948008 hartree
electener: -3130.83223464 hartree
oneelecener: -5550.84199025 hartree
twoeener: 2420.00975561 hartree
cpcmener: -0.04033974 hartree
kineticenergy: 1066.87456331 hartree
xcener: -102.626211843428 hartree
chargesum: 0.0000000
charge: -0.250064 -0.469382 -0.445745 -0.486054 -0.106444 -0.124915 0.141648 -0.014710 -0.154707 -0.269508 -0.286759 -0.249922 0.423385 -0.032254 -0.231289 -0.262937 0.054427 0.286688 0.346584 0.006051 -0.055303 -0.434294 0.064354 0.113696 0.095662 0.096289 0.093065 0.086467 0.080718 0.099252 0.103592 0.121110 0.077796 0.111296 0.088958 0.092948 0.093775 0.105569 0.143353 0.131998 0.127585 0.124871 0.134705 0.143944 0.284501
qa: -0.2501 -0.4694 -0.4457 -0.4861 -0.1064 -0.1249 0.1416 -0.0147 -0.1547 -0.2695 -0.2868 -0.2499 0.4234 -0.0323 -0.2313 -0.2629 0.0544 0.2867 0.3466 0.0061 -0.0553 -0.4343 0.0644 0.1137 0.0957 0.0963 0.0931 0.0865 0.0807 0.0993 0.1036 0.1211 0.0778 0.1113 0.0890 0.0929 0.0938 0.1056 0.1434 0.1320 0.1276 0.1249 0.1347 0.1439 0.2845
va: 2.1034 2.0372 2.0675 2.0244 3.1480 3.1892 3.7161 3.7911 3.8827 3.9092 3.9191 3.8371 4.0943 3.7087 3.9156 3.9437 3.9067 4.1966 4.3193 3.8920 3.8769 3.7294 3.5731 1.0050 1.0277 1.0017 1.0020 1.0054 1.0061 1.0000 1.0014 0.9983 1.0039 0.9971 1.0051 1.0076 1.0045 1.0001 0.9975 1.0108 1.0068 1.0060 1.0077 0.9852 0.9483
dispcorr: -0.026242203 hartree
energy: -1071.568996758054
dipole: 13.13645 -14.81767 -1.68122 -14.00029 12.67395 -1.32634 4.41384 -3.00889 1.40495
magnitude: 2.56117 au
magnitude: 6.50997 debye
