program: Orca
programVersion: 5.0.2
elementType: O O O O N N C C C C C C C C C C C C C C C C C H H H H H H H H H H H H H H H H H H H H H H
charge: 0
multiplicity: 1
keywords: wb97x-d3
keywords: def2-TZVPP
keywords: def2/J RIJCOSX
keywords: DEFGRID2
keywords: scfconv7
keywords: smallprint printgap noloewdin
keywords: NOSOSCF
formula: C17H22N2O4
InChI: InChI=1/C17H22N2O4/c1-6-7-18-9-13(20)19(16(18)22)10-23-15(21)14-12(8-11(2)3)17(14,4)5/h1,8,12,14H,7,9-10H2,2-5H3
45 atoms
O  0.903793 1.776622 -0.9494
O  1.156586 0.971447 1.118313
O  -1.560281 2.271202 2.044071
O  -1.722454 0.876644 -2.294915
N  -1.343226 1.762956 -0.193308
N  -3.051092 0.39234 -0.474048
C  3.885745 -0.133211 0.150268
C  2.904896 -1.159739 -0.294211
C  2.665391 0.317629 -0.63197
C  5.182748 -0.043939 -0.620242
C  4.054852 0.200941 1.61191
C  2.025846 -1.898729 0.644892
C  1.532233 1.028288 -0.025614
C  0.853384 -2.443569 0.309934
C  0.032135 -3.199748 1.308106
C  0.255221 -2.328777 -1.057693
C  -0.202902 2.557613 -0.542132
C  -1.905747 1.676873 1.055252
C  -2.026241 0.97664 -1.127714
C  -3.054664 0.70978 0.929269
C  -3.932356 -0.584105 -1.059494
C  -3.657882 -1.937946 -0.581263
C  -3.4339 -3.043473 -0.168025
H  3.19771 -1.724583 -1.175555
H  2.847763 0.586537 -1.665723
H  5.050227 -0.286411 -1.675671
H  5.606767 0.960407 -0.560049
H  5.918711 -0.73982 -0.211969
H  4.385679 1.2342 1.733593
H  3.155881 0.071224 2.207014
H  4.827806 -0.440467 2.040792
H  2.378569 -2.018592 1.664936
H  -0.17792 -4.214778 0.959954
H  0.526054 -3.272002 2.277442
H  -0.937441 -2.717111 1.461074
H  0.019548 -3.31634 -1.463408
H  -0.690708 -1.782613 -1.019635
H  0.900767 -1.820281 -1.771662
H  0.041782 3.196072 0.306509
H  -0.435208 3.18593 -1.398699
H  -2.875845 -0.168463 1.557538
H  -3.989526 1.176585 1.248742
H  -3.82949 -0.54391 -2.144391
H  -4.968311 -0.319724 -0.833937
H  -3.24415 -4.029874 0.193378
elementType: O N C H
totalener: -1071.54434925 hartree
nucrepener: 2059.50182562 hartree
electener: -3131.04617487 hartree
oneelecener: -5552.11012823 hartree
twoeener: 2421.06395336 hartree
cpcmener: -0.04384876 hartree
kineticenergy: 1066.87279909 hartree
xcener: -102.627638019384 hartree
chargesum: 0.0000000
charge: -0.284630 -0.454553 -0.442810 -0.485271 -0.110655 -0.136608 0.139236 -0.023010 -0.123030 -0.262658 -0.297961 -0.267483 0.410579 0.023579 -0.249216 -0.259105 0.069099 0.297227 0.350719 -0.008822 -0.043931 -0.402763 0.028171 0.111334 0.093630 0.086321 0.095425 0.094292 0.100441 0.095019 0.098166 0.121780 0.098622 0.095394 0.086048 0.113322 0.052299 0.099216 0.132516 0.148767 0.125744 0.125492 0.132859 0.142160 0.285054
qa: -0.2846 -0.4546 -0.4428 -0.4853 -0.1107 -0.1366 0.1392 -0.0230 -0.1230 -0.2627 -0.2980 -0.2675 0.4106 0.0236 -0.2492 -0.2591 0.0691 0.2972 0.3507 -0.0088 -0.0439 -0.4028 0.0282 0.1113 0.0936 0.0863 0.0954 0.0943 0.1004 0.0950 0.0982 0.1218 0.0986 0.0954 0.0860 0.1133 0.0523 0.0992 0.1325 0.1488 0.1257 0.1255 0.1329 0.1422 0.2851
va: 2.1093 2.0415 2.0764 2.0324 3.0870 3.1862 3.7429 3.8257 3.8317 3.9003 3.8951 3.8591 4.0928 3.6406 3.9402 3.9505 3.9031 4.2112 4.3316 3.8880 3.8766 3.7091 3.6153 1.0057 1.0307 1.0044 1.0026 1.0023 1.0006 1.0172 0.9986 1.0025 0.9939 1.0122 0.9935 1.0000 1.0050 1.0132 1.0177 0.9940 1.0025 1.0082 1.0078 0.9853 0.9492
dispcorr: -0.025654435 hartree
energy: -1071.570003687533
dipole: 16.64022 -17.56110 -0.92088 -15.55068 14.71979 -0.83089 2.27543 -2.81851 -0.54309
magnitude: 1.35401 au
magnitude: 3.44161 debye
