program: Orca
programVersion: 5.0.2
elementType: O O O O N N C C C C C C C C C C C C C C C C C H H H H H H H H H H H H H H H H H H H H H H
charge: 0
multiplicity: 1
keywords: wb97x-d3
keywords: def2-TZVPP
keywords: def2/J RIJCOSX
keywords: DEFGRID2
keywords: scfconv7
keywords: smallprint printgap noloewdin
keywords: NOSOSCF
formula: C17H22N2O4
InChI: InChI=1/C17H22N2O4/c1-6-7-18-9-13(20)19(16(18)22)10-23-15(21)14-12(8-11(2)3)17(14,4)5/h1,8,12,14H,7,9-10H2,2-5H3
45 atoms
O  0.787064 1.852585 -1.062003
O  1.199683 1.285334 1.058454
O  -1.560802 2.405665 2.008562
O  -1.624815 0.219919 -1.993458
N  -1.368129 1.560323 -0.125588
N  -2.544929 -0.297883 0.054423
C  3.915707 0.183617 0.094019
C  2.961348 -0.871232 -0.350843
C  2.694927 0.607026 -0.69393
C  5.21301 0.289437 -0.675274
C  4.085612 0.527166 1.553884
C  2.077073 -1.62295 0.565561
C  1.524326 1.268338 -0.102772
C  1.145219 -2.490407 0.156292
C  0.285679 -3.228094 1.135422
C  0.861305 -2.7609 -1.294302
C  -0.427499 2.481087 -0.692582
C  -1.793688 1.564098 1.179298
C  -1.842004 0.444242 -0.823481
C  -2.630784 0.322534 1.349577
C  -3.239257 -1.511591 -0.284793
C  -4.678316 -1.312628 -0.446609
C  -5.862578 -1.155541 -0.568477
H  3.271454 -1.427414 -1.230854
H  2.869463 0.869923 -1.730721
H  5.959398 -0.393305 -0.263994
H  5.086186 0.04249 -1.730401
H  5.620359 1.300838 -0.617273
H  4.39568 1.567547 1.668356
H  3.195017 0.384073 2.157635
H  4.874863 -0.096248 1.979266
H  2.202913 -1.469854 1.632091
H  -0.774422 -3.031386 0.949491
H  0.416581 -4.309253 1.037521
H  0.502718 -2.953178 2.167683
H  1.767213 -2.823393 -1.898876
H  0.316527 -3.696405 -1.425284
H  0.246413 -1.969117 -1.730424
H  -0.264699 3.287675 0.022085
H  -0.818599 2.901988 -1.615444
H  -2.21898 -0.310367 2.14005
H  -3.65618 0.589709 1.620408
H  -3.058626 -2.253953 0.496158
H  -2.814845 -1.917888 -1.203646
H  -6.914549 -1.015568 -0.680404
elementType: O N C H
totalener: -1071.54230936 hartree
nucrepener: 2049.97585839 hartree
electener: -3121.51816775 hartree
oneelecener: -5532.63456944 hartree
twoeener: 2411.11640169 hartree
cpcmener: -0.04276739 hartree
kineticenergy: 1066.86621107 hartree
xcener: -102.624948474254 hartree
chargesum: -0.0000000
charge: -0.281751 -0.457512 -0.441720 -0.487179 -0.122586 -0.134755 0.132443 -0.051062 -0.089653 -0.262039 -0.286302 -0.239862 0.393449 -0.043886 -0.218896 -0.281167 0.081239 0.293924 0.362124 -0.002525 -0.112621 -0.445747 0.126433 0.115416 0.092888 0.095027 0.086198 0.095508 0.100863 0.092175 0.097259 0.126677 0.085862 0.101523 0.088889 0.103544 0.099078 0.095764 0.133332 0.145256 0.122697 0.127825 0.144841 0.134698 0.284330
qa: -0.2818 -0.4575 -0.4417 -0.4872 -0.1226 -0.1348 0.1324 -0.0511 -0.0897 -0.2620 -0.2863 -0.2399 0.3934 -0.0439 -0.2189 -0.2812 0.0812 0.2939 0.3621 -0.0025 -0.1126 -0.4457 0.1264 0.1154 0.0929 0.0950 0.0862 0.0955 0.1009 0.0922 0.0973 0.1267 0.0859 0.1015 0.0889 0.1035 0.0991 0.0958 0.1333 0.1453 0.1227 0.1278 0.1448 0.1347 0.2843
va: 2.1101 2.0385 2.0793 2.0314 3.0969 3.1688 3.7869 3.7972 3.8315 3.8951 3.8869 3.8118 4.1176 3.7253 3.9199 3.9341 3.8970 4.2077 4.3165 3.8814 3.9373 3.8873 3.4924 1.0031 1.0306 1.0024 1.0047 1.0027 1.0000 1.0215 0.9998 1.0033 0.9929 0.9970 1.0092 1.0062 1.0023 1.0088 1.0163 0.9926 1.0077 1.0058 0.9781 1.0022 0.9474
dispcorr: -0.024795140 hartree
energy: -1071.567104503686
dipole: 19.05196 -19.41411 -0.36215 -15.97215 14.57714 -1.39501 1.49501 -1.73406 -0.23905
magnitude: 1.46094 au
magnitude: 3.71341 debye
