program: Orca
programVersion: 5.0.2
elementType: O O O O N N C C C C C C C C C C C C C C C C C H H H H H H H H H H H H H H H H H H H H H H
charge: 0
multiplicity: 1
keywords: wb97x-d3
keywords: def2-TZVPP
keywords: def2/J RIJCOSX
keywords: DEFGRID2
keywords: scfconv7
keywords: smallprint printgap noloewdin
keywords: NOSOSCF
formula: C17H22N2O4
InChI: InChI=1/C17H22N2O4/c1-6-7-18-9-13(20)19(16(18)22)10-23-15(21)14-12(8-11(2)3)17(14,4)5/h1,8,12,14H,7,9-10H2,2-5H3
45 atoms
O  0.140819 0.11757 0.048488
O  2.04136 1.223382 0.416767
O  -2.540336 -0.012607 2.203581
O  -2.03774 1.819846 -1.936774
N  -1.964158 1.018452 0.233043
N  -3.896047 1.016444 -0.834361
C  3.377505 -1.095416 -1.201927
C  3.413066 -1.528456 0.219721
C  2.094297 -1.04269 -0.386515
C  3.398563 -2.173967 -2.258982
C  4.076641 0.167229 -1.640824
C  4.140715 -0.767872 1.266977
C  1.479533 0.212631 0.060348
C  3.773914 -0.687785 2.548106
C  4.587566 0.073101 3.548452
C  2.525073 -1.31336 3.086287
C  -0.583377 1.26465 0.477543
C  -2.821192 0.397777 1.103728
C  -2.595102 1.333046 -0.977142
C  -4.155455 0.340657 0.412456
C  -4.846752 1.042135 -1.918015
C  -5.063027 -0.276136 -2.508898
C  -5.26008 -1.363925 -2.978539
H  3.402823 -2.605016 0.371235
H  1.377144 -1.822947 -0.611385
H  2.887859 -3.078693 -1.927549
H  2.914515 -1.833041 -3.175946
H  4.426929 -2.444229 -2.506181
H  3.565296 0.611047 -2.496644
H  4.152763 0.926377 -0.867666
H  5.092357 -0.075822 -1.958404
H  5.054284 -0.267116 0.958967
H  5.460371 0.54424 3.096977
H  3.988681 0.854506 4.023246
H  4.933737 -0.580927 4.35277
H  2.015056 -1.948657 2.364535
H  2.744796 -1.918292 3.96926
H  1.820787 -0.542173 3.410499
H  -0.434872 1.438696 1.542988
H  -0.27842 2.153103 -0.073023
H  -4.459411 -0.699966 0.267352
H  -4.922142 0.844132 1.004907
H  -4.496726 1.741263 -2.677228
H  -5.795148 1.435814 -1.548378
H  -5.433875 -2.327896 -3.402319
elementType: O N C H
totalener: -1071.53813461 hartree
nucrepener: 1932.13885843 hartree
electener: -3003.67699304 hartree
oneelecener: -5297.15864710 hartree
twoeener: 2293.48165406 hartree
cpcmener: -0.05094752 hartree
kineticenergy: 1066.86507382 hartree
xcener: -102.625847370508 hartree
chargesum: 0.0000000
charge: -0.287719 -0.491672 -0.475063 -0.516043 -0.127017 -0.156625 0.129537 -0.010540 -0.090627 -0.265216 -0.297231 -0.285959 0.410200 -0.018324 -0.223774 -0.265911 0.078755 0.318228 0.406552 0.000698 -0.047883 -0.430526 0.060811 0.116715 0.096193 0.088636 0.096312 0.094198 0.103103 0.094112 0.100117 0.124753 0.089394 0.094482 0.096781 0.095544 0.106814 0.099533 0.138636 0.130022 0.129147 0.127765 0.132427 0.142982 0.287685
qa: -0.2877 -0.4917 -0.4751 -0.5160 -0.1270 -0.1566 0.1295 -0.0105 -0.0906 -0.2652 -0.2972 -0.2860 0.4102 -0.0183 -0.2238 -0.2659 0.0788 0.3182 0.4066 0.0007 -0.0479 -0.4305 0.0608 0.1167 0.0962 0.0886 0.0963 0.0942 0.1031 0.0941 0.1001 0.1248 0.0894 0.0945 0.0968 0.0955 0.1068 0.0995 0.1386 0.1300 0.1291 0.1278 0.1324 0.1430 0.2877
va: 2.1005 1.9892 2.0366 2.0005 3.1569 3.2043 3.7346 3.8198 3.8495 3.9030 3.8955 3.8519 4.0372 3.7045 3.9252 3.9423 3.8956 4.1716 4.2857 3.8995 3.8931 3.7424 3.5741 1.0054 1.0286 1.0046 1.0022 1.0020 1.0003 1.0137 0.9982 0.9999 1.0068 0.9965 0.9967 1.0053 0.9999 0.9985 0.9983 1.0067 1.0056 1.0070 1.0054 0.9853 0.9453
dispcorr: -0.021100380 hartree
energy: -1071.559234985701
dipole: 26.32038 -28.23462 -1.91424 -9.21249 8.19020 -1.02229 4.28327 -4.54775 -0.26448
magnitude: 2.18617 au
magnitude: 5.55679 debye
